program: Orca
programVersion: 5.0.2
elementType: O O O N N C C C C C C C C C C C C C C C C C C H H H H H H H H H H H H H H H H H H H H H H H H H H H H
charge: 0
multiplicity: 1
keywords: wb97x-d3
keywords: def2-TZVPP
keywords: def2/J RIJCOSX
keywords: DEFGRID2
keywords: scfconv7
keywords: smallprint printgap noloewdin
keywords: NOSOSCF
formula: C18H28N2O3
InChI: InChI=1/C18H28N2O3/c1-11(2)16(20-18(22)23-12(3)4)17(21)19-14(6)15-9-7-13(5)8-10-15/h7-12,14,16,19-20H,1-6H3
51 atoms
O  2.112872 -2.289105 -1.131587
O  0.529165 2.84682 0.372878
O  0.439054 1.832357 -1.644651
N  0.784098 -1.295808 0.412325
N  1.873736 1.139637 -0.019309
C  2.454912 0.045153 -0.757733
C  3.963461 -0.08232 -0.494255
C  1.760552 -1.3030 -0.516239
C  -0.08414 -2.425178 0.683361
C  4.710906 1.159911 -0.963731
C  4.283009 -0.401042 0.963946
C  -1.517477 -2.059024 0.366447
C  0.09907 -2.920487 2.114206
C  0.902792 1.939291 -0.538619
C  -2.2056 -1.111459 1.118179
C  -2.175122 -2.638425 -0.710552
C  -4.164152 -1.331085 -0.282936
C  -3.503891 -0.751235 0.796446
C  -3.477586 -2.284107 -1.026793
C  -0.59279 3.686497 0.057624
C  -5.559759 -0.919728 -0.649908
C  -0.468343 4.908952 0.943951
C  -1.891119 2.93466 0.28978
H  2.31422 0.25411 -1.821306
H  4.292972 -0.929847 -1.098882
H  0.230293 -3.217521 0.003067
H  5.787544 1.024666 -0.854415
H  4.433832 2.045375 -0.389069
H  4.509528 1.373669 -2.014148
H  3.756703 -1.288157 1.317608
H  5.350156 -0.587981 1.085091
H  4.039372 0.426309 1.636695
H  0.531348 -0.407085 0.810896
H  2.247784 1.37759 0.884648
H  1.133324 -3.220771 2.280449
H  -0.148654 -2.151349 2.847618
H  -0.543151 -3.779034 2.308629
H  -1.733848 -0.643066 1.975511
H  -1.660453 -3.37502 -1.315613
H  -4.01465 -0.009005 1.398857
H  -3.965469 -2.756112 -1.871504
H  -0.529424 3.986469 -0.991142
H  -6.111491 -0.55201 0.214777
H  -5.550003 -0.120307 -1.393568
H  -6.124619 -1.749075 -1.074806
H  0.470957 5.434053 0.770804
H  -1.281843 5.603167 0.733572
H  -0.522064 4.641708 2.000434
H  -2.739684 3.583327 0.069287
H  -1.977484 2.617394 1.330674
H  -1.972758 2.056882 -0.349712
totalener: -1038.13537620 hartree
nucrepener: 2047.58848003 hartree
electener: -3085.72385623 hartree
oneelecener: -5479.86359702 hartree
twoeener: 2394.13974079 hartree
kineticenergy: 1033.46414966 hartree
xcener: -101.564099329027 hartree
chargesum: -0.0000000
charge: -0.412501 -0.323690 -0.403627 -0.183698 -0.307413 0.094401 0.030572 0.243291 0.118252 -0.270987 -0.289195 0.051913 -0.251042 0.458739 -0.197026 -0.118213 0.023671 -0.186653 -0.136045 0.152038 -0.206402 -0.231674 -0.271424 0.112621 0.061598 0.072786 0.090006 0.070574 0.093227 0.101142 0.093639 0.058787 0.136779 0.157882 0.098019 0.070650 0.096275 0.108218 0.115368 0.107095 0.109134 0.067132 0.082901 0.101534 0.086651 0.092216 0.079054 0.079765 0.087870 0.071738 0.114049
qa: -0.4125 -0.3237 -0.4036 -0.1837 -0.3074 0.0944 0.0306 0.2433 0.1183 -0.2710 -0.2892 0.0519 -0.2510 0.4587 -0.1970 -0.1182 0.0237 -0.1867 -0.1360 0.1520 -0.2064 -0.2317 -0.2714 0.1126 0.0616 0.0728 0.0900 0.0706 0.0932 0.1011 0.0936 0.0588 0.1368 0.1579 0.0980 0.0707 0.0963 0.1082 0.1154 0.1071 0.1091 0.0671 0.0829 0.1015 0.0867 0.0922 0.0791 0.0798 0.0879 0.0717 0.1140
va: 2.1238 2.0705 2.1081 3.1638 3.1161 3.7990 3.8408 4.3070 3.8218 3.9414 3.9496 3.6102 3.9571 4.3405 4.0025 4.0153 3.7748 4.0075 3.9848 3.8714 3.9077 3.9303 3.8976 1.0385 1.0359 1.0593 1.0068 1.0117 1.0071 1.0101 1.0075 1.0059 1.0581 1.0408 1.0083 1.0056 1.0091 1.0105 1.0104 1.0087 1.0080 1.0220 1.0050 0.9922 1.0039 1.0110 1.0086 1.0086 1.0109 1.0094 1.0134
dispcorr: -0.025681091 hartree
energy: -1038.161057289692
dipole: 0.50866 -1.02789 -0.51923 8.82263 -7.82241 1.00022 8.56443 -7.15197 1.41246
magnitude: 1.80695 au
magnitude: 4.59291 debye
