program: Orca
programVersion: 5.0.2
elementType: O O O N N C C C C C C C C C C C C C C C C C C H H H H H H H H H H H H H H H H H H H H H H H H H H H H
charge: 0
multiplicity: 1
keywords: wb97x-d3
keywords: def2-TZVPP
keywords: def2/J RIJCOSX
keywords: DEFGRID2
keywords: scfconv7
keywords: smallprint printgap noloewdin
keywords: NOSOSCF
formula: C18H28N2O3
InChI: InChI=1/C18H28N2O3/c1-11(2)16(20-18(22)23-12(3)4)17(21)19-14(6)15-9-7-13(5)8-10-15/h7-12,14,16,19-20H,1-6H3
51 atoms
O  -0.250687 -0.117325 -1.53862
O  1.949397 3.706319 -1.023181
O  3.105344 2.424951 0.43038
N  0.650872 -1.723273 -0.229537
N  0.99964 1.872955 -0.235246
C  0.97059 0.589742 0.40929
C  0.14683 0.588504 1.71948
C  0.39874 -0.438159 -0.563868
C  -0.058215 -2.838079 -0.83556
C  0.710166 1.600819 2.709331
C  -1.339129 0.826929 1.476263
C  -1.428536 -3.000935 -0.212781
C  0.794579 -4.095673 -0.748379
C  2.113269 2.64581 -0.223619
C  -1.58097 -3.504427 1.076834
C  -2.567281 -2.603782 -0.898726
C  -3.980831 -3.236694 0.959708
C  -2.833656 -3.62071 1.65146
C  -3.824341 -2.722381 -0.32099
C  3.0539 4.60977 -1.168302
C  -5.337555 -3.397319 1.580682
C  2.465121 5.925948 -1.635543
C  4.071902 4.054157 -2.149166
H  2.000218 0.317337 0.659951
H  0.256528 -0.407648 2.164907
H  -0.188705 -2.586693 -1.888956
H  1.779024 1.463612 2.872804
H  0.205761 1.50878 3.672006
H  0.558386 2.621484 2.357208
H  -1.506396 1.776777 0.965575
H  -1.802473 0.037344 0.883711
H  -1.872764 0.872051 2.426089
H  1.129128 -1.901517 0.638561
H  0.309321 2.033487 -0.953272
H  1.737859 -3.955984 -1.275324
H  1.024588 -4.368554 0.283391
H  0.271696 -4.938577 -1.196556
H  -0.714142 -3.817481 1.64782
H  -2.471713 -2.185122 -1.892853
H  -2.924037 -4.02012 2.655013
H  -4.696608 -2.404518 -0.879622
H  3.530399 4.749349 -0.19459
H  -5.620317 -4.44993 1.640442
H  -5.363911 -2.998943 2.595341
H  -6.106763 -2.885532 1.004196
H  1.738378 6.313012 -0.921719
H  3.25627 6.667834 -1.742453
H  1.972556 5.820139 -2.603005
H  4.504448 3.121518 -1.791046
H  4.887371 4.765978 -2.281936
H  3.618818 3.878708 -3.125998
totalener: -1038.13796380 hartree
nucrepener: 1994.25565897 hartree
electener: -3032.39362277 hartree
oneelecener: -5373.59147034 hartree
twoeener: 2341.19784757 hartree
kineticenergy: 1033.46495721 hartree
xcener: -101.565335093364 hartree
chargesum: -0.0000000
charge: -0.413368 -0.319545 -0.439651 -0.186278 -0.264644 0.073611 0.060362 0.242799 0.142711 -0.284914 -0.275352 -0.000143 -0.260152 0.452864 -0.173796 -0.112321 0.006559 -0.164922 -0.134191 0.145587 -0.207143 -0.231770 -0.259694 0.111660 0.023422 0.081187 0.101348 0.089523 0.083042 0.085531 0.092901 0.082962 0.128976 0.158946 0.106407 0.070261 0.099562 0.106008 0.115530 0.110750 0.109203 0.060822 0.098932 0.092159 0.080868 0.090439 0.075881 0.082238 0.102707 0.079868 0.082256
qa: -0.4134 -0.3195 -0.4397 -0.1863 -0.2646 0.0736 0.0604 0.2428 0.1427 -0.2849 -0.2754 -0.0001 -0.2602 0.4529 -0.1738 -0.1123 0.0066 -0.1649 -0.1342 0.1456 -0.2071 -0.2318 -0.2597 0.1117 0.0234 0.0812 0.1013 0.0895 0.0830 0.0855 0.0929 0.0830 0.1290 0.1589 0.1064 0.0703 0.0996 0.1060 0.1155 0.1108 0.1092 0.0608 0.0989 0.0922 0.0809 0.0904 0.0759 0.0822 0.1027 0.0799 0.0823
va: 2.0869 2.0960 2.0633 3.1895 3.1986 3.8443 3.7933 4.2768 3.8609 3.9473 3.9542 3.5548 3.9537 4.3606 4.0010 4.0059 3.7844 4.0410 3.9814 3.8774 3.9113 3.9317 3.8987 1.0410 1.0258 1.0223 1.0112 1.0056 1.0092 1.0140 1.0091 1.0052 1.0403 1.0545 1.0066 1.0046 1.0074 1.0098 1.0219 1.0074 1.0083 1.0234 0.9935 0.9992 1.0088 1.0109 1.0080 1.0090 1.0200 1.0094 1.0092
dispcorr: -0.025191781 hartree
energy: -1038.163155581266
dipole: -0.43371 0.03976 -0.39395 4.81497 -5.61492 -0.79995 5.40600 -4.93559 0.47041
magnitude: 1.00817 au
magnitude: 2.56256 debye
