program: Orca
programVersion: 5.0.2
elementType: O O O N N C C C C C C C C C C C C C C C C C C H H H H H H H H H H H H H H H H H H H H H H H H H H H H
charge: 0
multiplicity: 1
keywords: wb97x-d3
keywords: def2-TZVPP
keywords: def2/J RIJCOSX
keywords: DEFGRID2
keywords: scfconv7
keywords: smallprint printgap noloewdin
keywords: NOSOSCF
formula: C18H28N2O3
InChI: InChI=1/C18H28N2O3/c1-11(2)16(20-18(22)23-12(3)4)17(21)19-14(6)15-9-7-13(5)8-10-15/h7-12,14,16,19-20H,1-6H3
51 atoms
O  -0.954139 0.524974 -1.327187
O  2.080205 3.750541 -0.894342
O  3.384197 1.977205 -0.394593
N  0.033602 -1.486691 -1.014444
N  1.114882 1.86789 -0.259808
C  1.044572 0.458554 0.008153
C  0.794496 0.140208 1.501425
C  -0.060784 -0.14925 -0.853346
C  -1.025338 -2.302235 -1.588626
C  1.924233 0.687036 2.365499
C  -0.557603 0.649547 1.986989
C  -1.945296 -2.804581 -0.494586
C  -0.420088 -3.397343 -2.454588
C  2.294099 2.486087 -0.510824
C  -3.036217 -2.029783 -0.107227
C  -1.705779 -3.986219 0.194224
C  -3.61933 -3.612067 1.626699
C  -3.857574 -2.427871 0.932913
C  -2.530706 -4.382378 1.237883
C  3.227086 4.575829 -1.140053
C  -4.519422 -4.037675 2.749804
C  3.781475 5.113438 0.167241
C  2.764627 5.680892 -2.068803
H  2.00472 0.01497 -0.272051
H  0.797752 -0.951967 1.599197
H  -1.59897 -1.637588 -2.235169
H  2.903047 0.352604 2.022522
H  1.798636 0.362168 3.399207
H  1.92909 1.777408 2.363785
H  -0.642288 1.72883 1.850159
H  -1.394868 0.175786 1.474279
H  -0.675012 0.447048 3.052029
H  0.760571 -1.973897 -0.515315
H  0.261295 2.31449 -0.559358
H  0.254814 -4.047978 -1.895184
H  -1.2014 -4.024428 -2.88187
H  0.151167 -2.95718 -3.270948
H  -3.237563 -1.099407 -0.624349
H  -0.872569 -4.622514 -0.078929
H  -4.700919 -1.80603 1.210136
H  -2.321337 -5.311155 1.755234
H  3.9956 3.979576 -1.63846
H  -4.174229 -4.960918 3.213333
H  -4.569938 -3.276274 3.529438
H  -5.538705 -4.207466 2.399474
H  4.122768 4.308627 0.816433
H  4.635403 5.763048 -0.028534
H  3.030738 5.699411 0.699776
H  2.368914 5.277724 -3.000718
H  3.603145 6.331981 -2.31575
H  1.990814 6.293705 -1.604558
totalener: -1038.13803540 hartree
nucrepener: 1983.45026088 hartree
electener: -3021.58829628 hartree
oneelecener: -5351.91149779 hartree
twoeener: 2330.32320151 hartree
kineticenergy: 1033.46006707 hartree
xcener: -101.564916009855 hartree
chargesum: -0.0000000
charge: -0.420401 -0.319055 -0.438167 -0.176077 -0.271282 0.082750 0.065547 0.240227 0.127318 -0.280147 -0.282258 0.028218 -0.264491 0.451188 -0.188032 -0.163047 0.003507 -0.137725 -0.150005 0.144371 -0.207137 -0.259483 -0.231905 0.112774 0.027682 0.091300 0.099637 0.089446 0.080438 0.084029 0.093136 0.083889 0.128121 0.160563 0.066565 0.105156 0.105004 0.132462 0.114771 0.115013 0.107920 0.062267 0.078365 0.096428 0.098295 0.102160 0.080447 0.080369 0.091891 0.075848 0.082112
qa: -0.4204 -0.3191 -0.4382 -0.1761 -0.2713 0.0828 0.0655 0.2402 0.1273 -0.2801 -0.2823 0.0282 -0.2645 0.4512 -0.1880 -0.1630 0.0035 -0.1377 -0.1500 0.1444 -0.2071 -0.2595 -0.2319 0.1128 0.0277 0.0913 0.0996 0.0894 0.0804 0.0840 0.0931 0.0839 0.1281 0.1606 0.0666 0.1052 0.1050 0.1325 0.1148 0.1150 0.1079 0.0623 0.0784 0.0964 0.0983 0.1022 0.0804 0.0804 0.0919 0.0758 0.0821
va: 2.0791 2.0969 2.0653 3.1943 3.1958 3.8414 3.7909 4.2809 3.8218 3.9479 3.9513 3.5820 3.9666 4.3603 3.9775 4.0202 3.7922 3.9636 4.0294 3.8777 3.9094 3.9018 3.9328 1.0403 1.0269 1.0272 1.0112 1.0058 1.0090 1.0138 1.0114 1.0055 1.0394 1.0538 1.0050 1.0048 1.0078 1.0214 1.0046 1.0057 1.0097 1.0237 1.0092 0.9967 0.9954 1.0198 1.0100 1.0089 1.0107 1.0079 1.0089
dispcorr: -0.024788880 hartree
energy: -1038.162824279804
dipole: 3.32043 -3.60460 -0.28417 4.03073 -4.89056 -0.85982 8.59312 -8.19275 0.40037
magnitude: 0.99013 au
magnitude: 2.51670 debye
