program: Orca
programVersion: 5.0.2
elementType: O O O N N C C C C C C C C C C C C C C C C C C H H H H H H H H H H H H H H H H H H H H H H H H H H H H
charge: 0
multiplicity: 1
keywords: wb97x-d3
keywords: def2-TZVPP
keywords: def2/J RIJCOSX
keywords: DEFGRID2
keywords: scfconv7
keywords: smallprint printgap noloewdin
keywords: NOSOSCF
formula: C18H28N2O3
InChI: InChI=1/C18H28N2O3/c1-11(2)16(20-18(22)23-12(3)4)17(21)19-14(6)15-9-7-13(5)8-10-15/h7-12,14,16,19-20H,1-6H3
51 atoms
O  -0.526606 0.026519 -1.580126
O  1.871254 3.731107 -0.963312
O  3.263477 2.241684 0.005049
N  0.539832 -1.772757 -0.72657
N  1.05773 1.781703 -0.314972
C  1.121301 0.417391 0.128283
C  0.61162 0.228334 1.578524
C  0.298168 -0.445998 -0.824766
C  -0.355263 -2.766856 -1.295112
C  1.407966 1.090169 2.550602
C  -0.884477 0.492175 1.709359
C  -1.571746 -2.957324 -0.413918
C  0.408174 -4.058015 -1.551528
C  2.166216 2.556971 -0.392155
C  -2.81268 -2.481772 -0.811513
C  -1.470528 -3.562082 0.836708
C  -3.828492 -3.226472 1.253556
C  -3.924555 -2.618432 0.008677
C  -2.578277 -3.693789 1.654771
C  2.926775 4.693308 -1.098832
C  -5.029441 -3.393875 2.137801
C  3.133913 5.443569 0.204549
C  2.51943 5.612757 -2.23303
H  2.167747 0.099088 0.094226
H  0.790398 -0.820481 1.844908
H  -0.688037 -2.370803 -2.255446
H  2.481829 0.931036 2.456165
H  1.120591 0.861365 3.577714
H  1.215035 2.15065 2.386289
H  -1.134335 1.504392 1.386578
H  -1.489443 -0.206408 1.130184
H  -1.193773 0.397812 2.750786
H  1.181561 -2.084302 -0.01567
H  0.239596 2.049904 -0.840828
H  -0.250255 -4.804271 -1.993146
H  1.237744 -3.883507 -2.23638
H  0.814489 -4.487517 -0.633447
H  -2.911101 -1.984175 -1.768245
H  -0.51561 -3.937741 1.187373
H  -4.881219 -2.236323 -0.326955
H  -2.471079 -4.168048 2.623487
H  3.850808 4.174391 -1.365705
H  -5.363436 -4.432992 2.15758
H  -4.812716 -3.105904 3.166913
H  -5.867568 -2.788738 1.794789
H  2.220909 5.95755 0.509542
H  3.444017 4.774638 1.005616
H  3.914502 6.195207 0.08094
H  2.374036 5.060088 -3.160976
H  3.297398 6.35644 -2.40543
H  1.594758 6.144023 -2.003089
totalener: -1038.13777955 hartree
nucrepener: 1996.93622069 hartree
electener: -3035.07400024 hartree
oneelecener: -5378.94667139 hartree
twoeener: 2343.87267115 hartree
kineticenergy: 1033.45720734 hartree
xcener: -101.563994003545 hartree
chargesum: 0.0000000
charge: -0.411692 -0.319128 -0.438834 -0.188659 -0.261839 0.064980 0.061361 0.245788 0.143327 -0.286718 -0.274431 0.001319 -0.258892 0.452210 -0.103641 -0.180912 0.002977 -0.130577 -0.160228 0.145287 -0.205821 -0.259398 -0.232640 0.114655 0.022723 0.078781 0.103262 0.089285 0.080838 0.087578 0.090333 0.083062 0.129175 0.159497 0.098574 0.106658 0.071584 0.113461 0.102212 0.108754 0.110250 0.061234 0.099069 0.090879 0.081426 0.080386 0.102477 0.080040 0.092109 0.076297 0.081562
qa: -0.4117 -0.3191 -0.4388 -0.1887 -0.2618 0.0650 0.0614 0.2458 0.1433 -0.2867 -0.2744 0.0013 -0.2589 0.4522 -0.1036 -0.1809 0.0030 -0.1306 -0.1602 0.1453 -0.2058 -0.2594 -0.2326 0.1147 0.0227 0.0788 0.1033 0.0893 0.0808 0.0876 0.0903 0.0831 0.1292 0.1595 0.0986 0.1067 0.0716 0.1135 0.1022 0.1088 0.1102 0.0612 0.0991 0.0909 0.0814 0.0804 0.1025 0.0800 0.0921 0.0763 0.0816
va: 2.0893 2.0966 2.0641 3.1925 3.1922 3.8534 3.7908 4.2711 3.8688 3.9498 3.9503 3.5499 3.9518 4.3561 4.0077 4.0036 3.7846 3.9827 4.0344 3.8795 3.9115 3.9010 3.9332 1.0380 1.0253 1.0229 1.0112 1.0059 1.0093 1.0145 1.0109 1.0052 1.0409 1.0550 1.0079 1.0065 1.0043 1.0203 1.0117 1.0082 1.0076 1.0236 0.9934 0.9998 1.0084 1.0091 1.0200 1.0101 1.0105 1.0077 1.0093
dispcorr: -0.025495461 hartree
energy: -1038.163275011995
dipole: 0.25328 -0.60692 -0.35364 5.32042 -6.15017 -0.82975 8.91997 -8.43446 0.48552
magnitude: 1.02434 au
magnitude: 2.60366 debye
