program: Orca
programVersion: 5.0.2
elementType: O O O N N C C C C C C C C C C C C C C C C C C H H H H H H H H H H H H H H H H H H H H H H H H H H H H
charge: 0
multiplicity: 1
keywords: wb97x-d3
keywords: def2-TZVPP
keywords: def2/J RIJCOSX
keywords: DEFGRID2
keywords: scfconv7
keywords: smallprint printgap noloewdin
keywords: NOSOSCF
formula: C18H28N2O3
InChI: InChI=1/C18H28N2O3/c1-11(2)16(20-18(22)23-12(3)4)17(21)19-14(6)15-9-7-13(5)8-10-15/h7-12,14,16,19-20H,1-6H3
51 atoms
O  1.468509 -2.049602 -0.078281
O  1.680451 3.344664 0.989709
O  -0.030481 2.392515 -0.132978
N  -0.066766 -0.555411 0.634091
N  1.996367 1.383921 0.019775
C  1.70272 0.243082 -0.824133
C  2.94962 -0.199277 -1.59944
C  1.040431 -0.914794 -0.050714
C  -0.893791 -1.518938 1.328963
C  3.330073 0.851371 -2.63816
C  4.143614 -0.536034 -0.708471
C  -1.899674 -2.188491 0.416518
C  -1.590352 -0.836219 2.501352
C  1.119068 2.38015 0.258565
C  -2.729022 -1.441224 -0.413181
C  -2.056231 -3.567077 0.428369
C  -3.858963 -3.439334 -1.176959
C  -3.691636 -2.057288 -1.195153
C  -3.023138 -4.183015 -0.352226
C  0.861643 4.460512 1.37971
C  -4.887866 -4.106216 -2.042935
C  0.75162 5.464116 0.247113
C  1.514713 5.052133 2.612432
H  0.960459 0.575608 -1.557918
H  2.667264 -1.113831 -2.125287
H  -0.227108 -2.289227 1.720668
H  4.183687 0.517548 -3.229192
H  3.60672 1.799175 -2.173102
H  2.50999 1.050285 -3.329979
H  4.570922 0.350617 -0.2308
H  3.888342 -1.260508 0.061745
H  4.944709 -0.96716 -1.309492
H  -0.431913 0.377212 0.502674
H  2.88916 1.417018 0.483119
H  -2.254574 -0.039139 2.161108
H  -2.199583 -1.552521 3.050712
H  -0.861464 -0.404899 3.188281
H  -2.629592 -0.362298 -0.456074
H  -1.411433 -4.171731 1.055274
H  -4.327302 -1.451379 -1.830324
H  -3.123675 -5.261649 -0.321049
H  -0.136208 4.094687 1.635472
H  -5.255422 -5.027888 -1.592215
H  -5.746626 -3.458618 -2.218394
H  -4.473702 -4.366249 -3.019244
H  0.26388 5.032998 -0.62529
H  0.156861 6.319659 0.569032
H  1.735427 5.83336 -0.046415
H  0.919699 5.888503 2.978791
H  2.515525 5.425718 2.392333
H  1.59025 4.319587 3.415741
totalener: -1038.13759456 hartree
nucrepener: 1995.17353310 hartree
electener: -3033.31112767 hartree
oneelecener: -5375.43644168 hartree
twoeener: 2342.12531401 hartree
kineticenergy: 1033.44585347 hartree
xcener: -101.562726641072 hartree
chargesum: -0.0000000
charge: -0.409640 -0.318601 -0.471942 -0.233009 -0.255700 0.068117 0.048726 0.263061 0.099655 -0.265412 -0.302372 0.067746 -0.250318 0.493442 -0.180778 -0.136004 0.003241 -0.154000 -0.131771 0.145205 -0.209876 -0.258014 -0.229902 0.108769 0.045790 0.075009 0.089169 0.075410 0.084145 0.056551 0.118336 0.088540 0.178457 0.152029 0.081670 0.092577 0.095779 0.108511 0.104132 0.105979 0.106355 0.060473 0.083628 0.083592 0.099994 0.105050 0.082816 0.081616 0.079477 0.083075 0.091218
qa: -0.4096 -0.3186 -0.4719 -0.2330 -0.2557 0.0681 0.0487 0.2631 0.0997 -0.2654 -0.3024 0.0677 -0.2503 0.4934 -0.1808 -0.1360 0.0032 -0.1540 -0.1318 0.1452 -0.2099 -0.2580 -0.2299 0.1088 0.0458 0.0750 0.0892 0.0754 0.0841 0.0566 0.1183 0.0885 0.1785 0.1520 0.0817 0.0926 0.0958 0.1085 0.1041 0.1060 0.1064 0.0605 0.0836 0.0836 0.1000 0.1050 0.0828 0.0816 0.0795 0.0831 0.0912
va: 2.1021 2.0996 2.0213 3.2058 3.1658 3.7940 3.8828 4.3025 3.9180 3.9331 3.9350 3.5863 3.9308 4.2956 4.0291 4.0476 3.7818 4.0208 3.9715 3.8683 3.9115 3.9028 3.9290 1.0205 1.0316 1.0321 1.0070 1.0129 1.0084 1.0052 1.0180 1.0068 1.0357 1.0449 1.0051 1.0096 1.0095 1.0153 1.0123 1.0092 1.0083 1.0233 1.0043 1.0042 0.9916 1.0196 1.0092 1.0091 1.0083 1.0089 1.0106
dispcorr: -0.023657441 hartree
energy: -1038.161252005982
dipole: 4.55782 -4.49358 0.06424 10.35291 -9.27324 1.07967 -0.68328 1.07073 0.38745
magnitude: 1.14888 au
magnitude: 2.92023 debye
