program: Gaussian 09
title: 000064672
version: EM64L-G09RevD.01
frameworkgroup: C1[X(C18H37NO2)]
method: RPBEPBE
basis: SDD
operation: Freq
keyword: #p
keyword: freq=noraman
keyword: PBEPBE/SDD
title: #p freq=noraman PBEPBE/SDD
converged: YES YES NO NO
title: Mulliken charges:
elementType: O O N C C C C C C C C C C C C C C C C C C H H H H H H H H H H H H H H H H H H H H H H H H H H H H H H H H H H H H H
charge: -0.402796 -0.331938 -0.099201 -0.360176 -0.407556 -0.380873 -0.391541 -0.474229 -0.387263 -0.568287 -0.573687 -0.388127 -0.386016 -0.386821 -0.384332 -0.382569 -0.372496 0.147571 -0.353612 -0.356565 -0.696699 0.334563 0.214313 0.200219 0.244272 0.222552 0.188895 0.207782 0.190271 0.254804 0.238388 0.192773 0.201707 0.241540 0.246755 0.259865 0.228249 0.218372 0.334914 0.198202 0.193072 0.195642 0.193319 0.193438 0.194833 0.192940 0.193306 0.191955 0.192326 0.189208 0.189449 0.187954 0.187468 0.194409 0.195048 0.210095 0.209280 0.215036
chargesum: 0.00000
title: Mulliken charges with hydrogens summed into heavy atoms:
elementType: O O N C C C C C C C C C C C C C C C C C C
charge: -0.402796 -0.331938 -0.099201 0.188700 0.036934 0.030573 0.006512 0.018963 0.007217 0.179873 0.207849 0.003147 0.002945 0.001450 0.001914 0.001712 0.006162 0.147571 0.021811 0.032892 -0.062288
polarizability: 2.65423958e+02 -3.36067468e+00 1.93363052e+02 -1.70786116e+00 -4.36013033e+00 1.81516458e+02
1716.lowfreq: -34.4171 -14.8204 -8.5939 -1.6804 -0.0023 0.0007 0.0021 12.5791 15.2401
frequency: -28.7624 2.7776 15.0949 19.7250 32.7373 43.7970 50.4391 57.0191 71.7977 79.3822 94.7032 103.0397 107.5807 122.7943 125.1123 136.0667 143.5978 159.1767 162.5060 180.2868 210.8585 228.3078 234.7246 239.3989 250.9692 284.8758 291.8303 323.2640 336.3463 347.8377 358.5281 389.9894 429.6392 447.1275 481.8727 486.7639 506.3603 515.2598 553.0577 651.0344 718.4345 719.9531 723.0269 730.3318 742.9399 748.9268 762.8411 788.5934 821.0968 823.9895 846.4466 869.7451 876.2110 887.6808 915.7595 943.6059 965.7002 974.7493 977.9790 985.9380 1005.1340 1006.6254 1024.2186 1033.0821 1038.7654 1057.7058 1064.3050 1076.1221 1077.9783 1080.1038 1081.5596 1085.4705 1096.8498 1106.5787 1123.9572 1153.6296 1171.5105 1180.8439 1195.9307 1199.4542 1210.3582 1214.8204 1225.1791 1231.2171 1248.2609 1250.7821 1263.3038 1269.4243 1271.1195 1276.2784 1279.1525 1282.6462 1284.9013 1290.5027 1294.4502 1295.3808 1296.8870 1301.4407 1315.1933 1328.1107 1335.8775 1347.4735 1352.9351 1353.4389 1356.5929 1357.0567 1364.6542 1389.6465 1408.1155 1420.1351 1429.7068 1455.1763 1457.3314 1457.6248 1459.5704 1460.4972 1462.0065 1463.5679 1464.6661 1466.5703 1470.6901 1473.5678 1475.2560 1475.9824 1477.6344 1480.0212 1483.7558 1486.2705 1488.4200 1510.4466 1612.2966 2948.1983 2948.3545 2949.9013 2950.2037 2951.5818 2953.0882 2955.8317 2959.1439 2962.4531 2965.0727 2967.7988 2970.8736 2971.1991 2978.5335 2981.5098 2983.9744 2984.8434 2987.7666 2992.7381 2998.9857 3006.3423 3010.4871 3014.5755 3022.7498 3027.9657 3030.5638 3037.2505 3042.6076 3047.7558 3067.8044 3068.4097 3070.1261 3100.5399 3110.3300 3117.3507 3123.6116 3140.2068
redmass: 1.8600 2.9499 4.2721 3.9968 2.7623 2.5791 3.8307 3.0005 2.0301 4.0796 2.0698 3.2699 2.4234 2.3955 2.5065 2.3881 1.8982 2.1063 3.1953 2.5197 2.2715 1.3528 1.1060 3.4830 3.6285 3.8001 1.1566 3.2549 3.4739 2.2997 3.3884 3.1217 2.8761 2.8627 2.6167 3.0017 2.6958 3.0331 3.4670 6.4411 1.0591 1.0635 1.0750 1.0924 1.1807 3.4328 1.1939 1.2446 1.6814 3.5809 2.1299 2.4473 1.5530 1.9062 1.3267 1.7785 1.5743 2.1721 3.5962 4.1613 1.2326 3.3945 3.7463 1.0763 3.2961 2.9093 2.8962 2.4075 2.0664 2.1396 2.1927 1.9298 1.5118 1.5933 2.8085 1.6297 1.4230 1.8309 1.6335 1.3056 3.8142 1.9527 1.3121 1.5005 1.2922 1.3653 1.4223 1.2798 1.3664 1.0156 1.4306 1.0492 1.1743 1.0646 1.2047 1.2080 1.1113 1.1222 1.3396 1.2160 1.3472 1.4704 1.7140 1.6062 1.6209 1.6211 1.2285 1.2180 1.2183 1.1145 1.1188 1.0795 1.0758 1.0736 1.0765 1.0701 1.0738 1.0768 1.0727 1.0842 1.0859 1.0575 1.0599 1.0776 1.0426 1.0901 1.0933 1.0955 1.0920 1.0559 7.8565 1.0586 1.0585 1.0589 1.0590 1.0593 1.0594 1.0595 1.0595 1.0596 1.0599 1.0587 1.0593 1.0365 1.0465 1.0958 1.0946 1.0523 1.0970 1.0986 1.1003 1.1016 1.0337 1.1027 1.1030 1.0613 1.1015 1.1039 1.1043 1.1046 1.1007 1.1064 1.0993 1.1020 1.1055 1.1035 1.1042 1.1027
irintensity: 0.7729 1.9752 3.1556 4.8145 3.0552 1.1385 0.8949 0.0502 0.2580 2.3656 0.6086 0.0120 0.5022 0.2892 1.5620 1.1079 0.0920 0.1289 0.2813 7.6558 4.9482 0.3173 0.0321 4.4773 1.4168 1.3569 0.8143 1.3782 6.3574 1.6229 0.5902 2.5295 0.7931 1.8888 0.4593 0.2895 0.2539 0.8426 1.5831 44.2134 16.8755 2.9066 8.6728 0.5377 5.6468 1.8757 3.0450 9.4646 22.0079 21.3613 19.5037 32.1634 7.8084 5.1104 0.3472 4.2768 1.2450 4.5927 1.6350 0.6053 1.5934 0.4797 6.6297 0.2309 0.3922 0.8178 1.4909 0.5048 0.7010 0.1494 0.0552 0.5935 7.9560 10.2996 11.1174 10.7782 11.7215 0.6735 1.4556 29.9098 104.0498 31.6604 2.3880 0.2925 3.6571 0.2114 4.8156 0.0581 0.5705 0.3634 0.7313 0.5276 0.1904 0.4474 0.1227 0.7092 0.2579 1.0129 0.6336 12.9753 7.6708 4.3358 0.0676 0.9489 0.3421 0.3602 11.7078 11.2530 76.0437 17.2864 29.2113 9.6701 1.3746 1.9130 7.9351 1.3849 5.2017 1.2644 9.6144 0.7740 1.6253 11.6974 19.3334 13.9899 12.3682 2.2785 4.7652 13.4434 37.8938 58.7551 296.6014 0.0143 0.0219 0.0737 0.2418 0.4186 0.5907 2.4293 0.8375 16.1912 124.5641 220.4698 36.0259 38.8145 40.1638 1.2705 2.4653 91.1016 4.1227 2.3784 1.5419 1.1557 24.1635 0.5231 1.7857 9.5310 5.8611 4.2512 195.1487 170.4732 97.4156 29.5025 55.8691 7.9863 9.9340 4.2048 31.0906 13.0762
temp: 298.150 k
press: 1.00000 atm
elementType: 8 8 7 6 6 6 6 6 6 6 6 6 6 6 6 6 6 6 6 6 6 1 1 1 1 1 1 1 1 1 1 1 1 1 1 1 1 1 1 1 1 1 1 1 1 1 1 1 1 1 1 1 1 1 1 1 1 1
symmnumber: 1
zpe: 1372634.5 jmol-1
zpe.correction: 0.522809 hartree
zpe.thermalcorrener: 0.549471 hartree
zpe.thermalcorrenthalpy: 0.550415 hartree
zpe.thermalcorrgfe: 0.459699 hartree
zpe.sumelectzpe: -911.522530 hartree
zpe.sumelectthermal: -911.495868 hartree
zpe.sumelectthermalent: -911.494924 hartree
zpe.sumelectthermalfe: -911.585639 hartree
dipole: -0.8963 -11.2087 -1.7859
dipole: 11.3854
quadrupole: -136.0117 -154.1883 -137.3422
quadrupole: -73.6264 -11.8361 0.2846
quadrupole: 6.5023 -11.6742 5.1719 -73.6264 -11.8361 0.2846
hfenergy: -912.0453389 hartree
pointgroup: C01 [X(C18H37N1O2)]
dipole: -0.3641927 -4.4503699 -0.355379 debye
polarizability: 265.3884214|-3.668625|192.6303793|-1.9522788|-5.200843|182.2846665 unknown
InChI: InChI=1S/C18H37NO2/c1-4-5-6-7-8-9-10-11-12-13-14-15-16-19(2,3)17-18(20)21/h4-17H2,1-3H3
charge 0 multiplicity 1
58 atoms
O  6.272431 1.843663 1.097601
O  6.538696 2.889833 -0.991954
N  6.424909 -0.773201 -0.123722
C  5.044423 -0.767499 0.583607
C  3.825092 -0.666756 -0.344097
C  2.525726 -0.685062 0.500602
C  1.251694 -0.557448 -0.364365
C  6.62355 0.523901 -0.966037
C  -0.047856 -0.573957 0.471508
C  6.567976 -1.985847 -1.022599
C  7.498975 -0.814837 0.962892
C  -1.325567 -0.411287 -0.382301
C  -2.624029 -0.429325 0.455429
C  -3.901765 -0.216645 -0.387217
C  -5.198301 -0.235749 0.453586
C  -6.474522 0.02167 -0.378836
C  -7.769507 0.002788 0.464625
C  6.454365 1.897494 -0.188985
C  -9.044429 0.289115 -0.360431
C  -10.338562 0.269146 0.48513
C  -11.606137 0.568619 -0.344221
H  5.097775 0.112032 1.251431
H  5.009302 -1.701824 1.17596
H  3.786666 -1.501881 -1.071911
H  3.856852 0.279342 -0.915228
H  2.557141 0.147587 1.231191
H  2.475754 -1.62443 1.090368
H  1.299524 0.385279 -0.947205
H  1.221731 -1.383729 -1.10546
H  5.904276 0.488302 -1.799972
H  7.64714 0.469864 -1.378731
H  -0.10649 -1.524034 1.043222
H  -0.007085 0.240503 1.224253
H  6.40713 -2.902131 -0.430007
H  7.582137 -1.991607 -1.452176
H  5.828086 -1.930491 -1.833919
H  8.489341 -0.827776 0.479378
H  7.35728 -1.723105 1.571023
H  7.367623 0.107589 1.555031
H  -1.26798 0.542936 -0.946452
H  -1.367661 -1.219849 -1.142061
H  -2.566165 0.360033 1.233964
H  -2.698035 -1.395313 0.997877
H  -3.9614 -1.000428 -1.171383
H  -3.827882 0.753068 -0.922721
H  -5.287291 -1.215246 0.968861
H  -5.124762 0.529995 1.254229
H  -6.549758 -0.740169 -1.183034
H  -6.385196 1.003509 -0.88944
H  -7.868831 -0.984991 0.961986
H  -7.68544 0.7527 1.27914
H  -8.946939 1.278578 -0.854687
H  -9.130686 -0.45804 -1.177274
H  -10.439452 -0.722218 0.972596
H  -10.247746 1.010358 1.3054
H  -11.545957 1.569628 -0.811919
H  -11.73219 -0.17239 -1.156367
H  -12.517274 0.542336 0.281623
