program: Orca
programVersion: 5.0.2
elementType: F O O O O N C C C C C C C C C C C C C C C C C C C C C H H H H H H H H H H H H H H H H H H H H H H
charge: 0
multiplicity: 1
keywords: wb97x-d3
keywords: def2-TZVPP
keywords: def2/J RIJCOSX
keywords: DEFGRID2
keywords: scfconv7
keywords: smallprint printgap noloewdin
keywords: NOSOSCF
formula: C21H22FNO4
InChI: InChI=1/C21H22FNO4/c1-25-19-8-5-16(13-20(19)26-2)18(15-3-6-17(22)7-4-15)14-21(24)23-9-11-27-12-10-23/h3-8,13-14H,9-12H2,1-2H3
49 atoms
F  -6.378989 0.925044 -0.047213
O  3.563297 -1.726224 1.831241
O  0.739795 -3.393754 -1.770231
O  1.026805 3.240986 1.249516
O  2.941673 3.102331 -0.453998
N  1.420663 -2.665122 0.256192
C  1.184864 -2.095159 1.570133
C  2.74716 -3.244011 0.123013
C  2.292449 -1.118457 1.921487
C  3.793396 -2.222602 0.531048
C  0.520395 -2.763934 -0.738296
C  -1.085652 -0.815769 -0.520007
C  -0.816943 -2.127646 -0.575386
C  -0.02877 0.215867 -0.572013
C  -2.485304 -0.352227 -0.386818
C  -0.042425 1.259802 0.364275
C  0.990526 0.171639 -1.507768
C  0.957254 2.213037 0.383235
C  -3.39272 -1.030269 0.427903
C  -2.929276 0.778081 -1.075068
C  2.008001 2.141505 -0.556571
C  2.004033 1.127372 -1.498887
C  -4.707734 -0.608838 0.545579
C  -4.241792 1.210936 -0.974159
C  -5.109345 0.507059 -0.161463
C  -0.033082 3.411616 2.167756
C  4.043016 3.061427 -1.338138
H  1.164303 -2.905398 2.307802
H  0.221254 -1.594663 1.61341
H  2.921115 -3.552037 -0.905077
H  2.822024 -4.135199 0.755615
H  2.237566 -0.241075 1.263667
H  2.165269 -0.775055 2.949438
H  4.78061 -2.687775 0.527586
H  3.805099 -1.400878 -0.199255
H  -1.63806 -2.835854 -0.624783
H  -0.843827 1.298497 1.090643
H  1.004928 -0.595851 -2.270637
H  -3.06682 -1.890621 0.998599
H  -2.247057 1.325291 -1.713071
H  2.783699 1.063994 -2.246175
H  -5.403139 -1.134153 1.187389
H  -4.582085 2.081825 -1.519443
H  -0.994701 3.543177 1.663598
H  0.189694 4.315023 2.731606
H  -0.110327 2.574402 2.867052
H  4.616991 2.136472 -1.233024
H  4.682739 3.900217 -1.0720
H  3.737065 3.174074 -2.381913
elementType: F O N C H
totalener: -1269.07998347 hartree
nucrepener: 2540.48275172 hartree
electener: -3809.56273519 hartree
oneelecener: -6781.57228102 hartree
twoeener: 2972.00954582 hartree
cpcmener: -0.03920032 hartree
kineticenergy: 1263.69482344 hartree
xcener: -120.373287697577 hartree
chargesum: 0.0000000
charge: -0.221777 -0.383533 -0.532584 -0.326322 -0.323224 -0.079025 -0.106076 -0.072597 0.062212 0.011371 0.254366 0.111007 -0.113724 0.061319 0.008134 -0.280467 -0.249320 0.222934 -0.181748 -0.181527 0.279609 -0.227208 -0.209027 -0.203073 0.307720 -0.131258 -0.128242 0.112519 0.116675 0.097104 0.107110 0.048523 0.109533 0.105392 0.079447 0.128506 0.145362 0.145403 0.152545 0.155080 0.140049 0.148794 0.150345 0.110788 0.123376 0.110618 0.110308 0.123166 0.111416
qa: -0.2218 -0.3835 -0.5326 -0.3263 -0.3232 -0.0790 -0.1061 -0.0726 0.0622 0.0114 0.2544 0.1110 -0.1137 0.0613 0.0081 -0.2805 -0.2493 0.2229 -0.1817 -0.1815 0.2796 -0.2272 -0.2090 -0.2031 0.3077 -0.1313 -0.1282 0.1125 0.1167 0.0971 0.1071 0.0485 0.1095 0.1054 0.0794 0.1285 0.1454 0.1454 0.1525 0.1551 0.1400 0.1488 0.1503 0.1108 0.1234 0.1106 0.1103 0.1232 0.1114
va: 1.0569 1.9418 1.9651 2.0654 2.0634 3.0985 3.8853 3.8326 3.9242 3.9648 4.2142 3.4060 3.7835 3.3828 3.4835 3.8388 3.9569 3.9155 3.9302 3.9017 3.8252 3.8679 3.9152 3.9010 3.9028 3.8803 3.8749 1.0092 1.0038 1.0430 1.0057 1.0482 1.0006 0.9989 1.0002 1.0131 1.0032 1.0239 1.0004 0.9966 1.0113 1.0006 0.9993 0.9878 0.9942 0.9856 0.9875 0.9940 0.9864
dispcorr: -0.027773066 hartree
energy: -1269.107756539568
dipole: 23.29675 -22.95464 0.34211 0.80777 0.17113 0.97889 5.50307 -4.21876 1.28430
magnitude: 1.65067 au
magnitude: 4.19566 debye
