program: Gaussian 09
title: 000064841
version: EM64L-G09RevD.01
frameworkgroup: C1[X(C21H25FN6O3S)]
method: RPBEPBE
basis: SDD
operation: Freq
keyword: #p
keyword: freq=noraman
keyword: PBEPBE/SDD
title: #p freq=noraman PBEPBE/SDD
converged: YES YES NO NO
title: Mulliken charges:
elementType: S F O O O N N N N N N C C C C C C C C C C C C C C C C C C C C C H H H H H H H H H H H H H H H H H H H H H H H H H
charge: 1.069792 -0.349090 -0.235356 -0.483556 -0.478719 -0.305454 -0.094560 -0.170355 -0.635034 -0.461869 -0.612326 0.181362 0.315060 -0.704050 -0.676397 0.234110 0.465331 -0.348407 -0.354413 -0.575696 -0.410303 -0.407130 -0.023616 -0.545672 0.198726 0.558669 0.590773 -0.338994 -0.633074 -0.360066 -0.227891 -0.804624 0.244999 0.233132 0.180826 0.235672 0.208846 0.235597 0.261250 0.266460 0.236718 0.242564 0.243533 0.249466 0.260874 0.232694 0.337323 0.341923 0.332652 0.318451 0.322812 0.237065 0.325102 0.293826 0.230566 0.276508 0.273969
chargesum: 0.00000
title: Mulliken charges with hydrogens summed into heavy atoms:
elementType: S F O O O N N N N N N C C C C C C C C C C C C C C C C C C C C C
charge: 1.069792 -0.349090 -0.235356 -0.483556 -0.478719 -0.305454 -0.094560 -0.170355 0.044212 -0.129217 0.028936 0.181362 0.315060 -0.045093 0.003718 0.234110 0.465331 -0.087157 -0.087953 -0.096415 -0.166770 -0.157663 -0.023616 -0.052105 0.198726 0.558669 0.590773 -0.338994 -0.396010 -0.034964 0.065935 -0.023580
polarizability: 3.55844343e+02 -1.76667942e+01 4.05047436e+02 2.35650163e+01 -5.71543345e+00 2.12918836e+02
1716.lowfreq: -7.9000 -3.6702 -0.0010 0.0002 0.0017 3.6427 10.3491 12.6561 21.4072
frequency: 10.1025 12.3188 21.2300 24.7904 34.0550 43.4480 44.9794 55.9231 70.2203 73.7496 96.6022 99.1601 120.5348 122.1522 128.9744 162.0815 164.1093 190.9606 194.9889 201.2239 218.8672 226.8088 228.7095 236.8062 265.3595 270.8386 273.2256 279.7866 288.0951 304.5352 311.4016 315.6059 341.2901 358.3547 359.8956 369.1152 384.1233 389.2312 410.9751 416.9451 430.1209 433.3535 447.2467 462.5925 491.6343 491.9996 516.0579 519.8491 522.6458 529.0559 538.8519 542.0981 554.4672 574.8453 580.4923 596.0309 636.4619 649.2616 657.5631 673.0233 675.9825 703.4512 714.6557 723.5445 739.8085 755.6875 772.4382 806.0832 832.6267 849.6137 853.6008 855.3215 865.2700 876.8616 886.7404 901.5550 905.9643 931.9400 946.2426 949.2239 967.4805 977.1256 980.3873 982.8540 983.9365 986.6858 991.8676 1001.3779 1011.5559 1031.8369 1048.2661 1053.1586 1101.6260 1103.9995 1121.3163 1127.1847 1130.8780 1145.5206 1166.5755 1183.0808 1187.6615 1195.5680 1212.3052 1240.1736 1254.0818 1263.3466 1272.7080 1291.6613 1303.8068 1309.2004 1332.6394 1360.7193 1361.7864 1365.9672 1377.3575 1393.2148 1404.6142 1406.0581 1411.6560 1444.7622 1446.6616 1456.6265 1458.3322 1459.6892 1461.2716 1468.5993 1473.4183 1473.9826 1487.3279 1498.8224 1511.3602 1532.3807 1566.2040 1570.6141 1584.5203 1601.7412 1604.8051 1612.9081 1618.6325 1631.7408 2976.5173 2990.3688 2995.3707 2998.3464 2999.9161 3060.5940 3075.9074 3079.6550 3089.3796 3090.4547 3093.1914 3106.4145 3108.8257 3118.7165 3124.2962 3126.5872 3153.6740 3159.4685 3160.8757 3201.4726 3510.2649 3553.8759 3567.3738 3708.5552 3729.1848
redmass: 5.5981 5.5610 5.7583 5.5856 5.4217 5.4971 8.2006 4.2047 4.3855 6.3402 4.9828 5.3960 1.3866 3.4440 6.0374 5.0619 7.6506 5.3903 4.2950 4.3472 3.2922 1.9425 2.2148 3.6985 3.8862 1.4240 2.8547 2.7202 7.8237 2.5384 7.2684 3.1567 2.4728 3.7830 3.3163 5.5869 1.2082 1.1832 3.7847 4.0757 3.3675 3.8191 3.0193 4.2353 2.7097 2.8835 3.5542 1.7810 6.4103 1.4191 1.9428 4.2802 7.6356 2.8136 3.3137 4.1256 6.6108 6.0227 4.4213 1.6993 3.2032 4.0805 3.0748 10.9144 3.4347 4.3220 4.1146 3.6259 1.7681 10.6841 1.3542 1.2925 2.5225 4.5017 1.6136 2.1740 1.7953 5.3930 1.8682 2.4660 1.4688 2.2678 5.7186 1.3998 1.4020 6.3657 1.3555 2.3368 2.6244 1.9248 3.5040 1.5301 1.3742 1.9446 2.2017 2.0468 1.4052 1.4445 1.3424 1.2263 2.8555 1.6281 2.3190 4.0958 1.7646 1.4995 4.4478 1.3700 1.4708 1.9705 1.4530 1.6120 2.3903 4.0189 1.2429 3.8746 3.0447 4.1416 1.2500 2.1210 1.4141 1.1721 1.3049 1.1246 1.5186 1.0678 1.1085 1.0629 1.1935 2.6644 2.2816 2.5701 5.9701 1.7984 4.8488 6.4350 2.7750 3.3239 2.4865 4.6188 1.0354 1.0359 1.0369 1.0609 1.0648 1.1015 1.0993 1.0972 1.0991 1.0988 1.0997 1.1005 1.0999 1.0895 1.0913 1.0891 1.0955 1.0960 1.0914 1.0953 1.0767 1.0444 1.0438 1.1053 1.1059
irintensity: 0.3572 0.6115 2.3189 0.1388 0.1490 0.3245 5.9068 0.3032 1.4866 0.5333 2.1059 0.4116 1.4111 0.6217 4.7093 0.5984 1.1503 5.5510 1.4298 5.0612 4.0740 1.1919 4.1760 2.6042 1.3327 2.5118 1.5186 0.8611 9.5112 6.5578 3.1231 4.4179 6.2806 11.4982 9.7428 1.8290 1.4509 360.8493 23.5385 7.0157 6.9406 20.4550 7.1274 22.5731 44.3071 13.7440 14.0406 4.2847 48.3714 34.0301 41.9255 9.2821 117.1641 60.5081 23.9957 1.8591 0.4508 4.1361 5.0144 67.6535 30.7467 2.7265 1.6847 34.8813 1.6047 1.7345 0.8736 43.2378 38.9272 102.6115 22.6132 0.3963 1.4364 21.5968 52.5235 4.3247 5.4906 9.1066 3.7497 11.0710 3.4356 15.2554 26.0269 0.5617 9.9121 43.1638 6.9488 4.2260 5.0551 1.3816 11.8600 13.7473 14.8617 4.6386 3.3110 38.1395 75.1364 4.1909 37.4342 4.9441 23.0347 0.8996 5.7025 23.6958 0.0103 74.1757 121.0575 10.0618 17.6970 55.4638 11.7921 13.6623 24.7111 132.6927 17.7976 10.2761 52.1171 308.0350 7.8062 114.3220 43.6577 26.7873 36.7661 28.4883 35.8376 4.0522 20.4153 24.2113 43.3183 80.0028 360.2399 273.9594 11.7546 212.3557 31.1401 167.5243 600.4543 77.4645 539.2453 113.3454 15.4375 43.9862 7.1186 31.8031 15.3160 13.0353 25.2361 1.8545 20.6316 54.4405 24.6767 10.8537 21.4588 11.8392 11.3691 12.8279 7.0252 1.9243 6.8825 11.4920 34.1931 57.7708 97.2535 57.7310 38.8159
temp: 298.150 k
press: 1.00000 atm
elementType: 16 9 8 8 8 7 7 7 7 7 7 6 6 6 6 6 6 6 6 6 6 6 6 6 6 6 6 6 6 6 6 6 1 1 1 1 1 1 1 1 1 1 1 1 1 1 1 1 1 1 1 1 1 1 1 1 1
symmnumber: 1
zpe: 1156195.3 jmol-1
zpe.correction: 0.440372 hartree
zpe.thermalcorrener: 0.472886 hartree
zpe.thermalcorrenthalpy: 0.473830 hartree
zpe.thermalcorrgfe: 0.373134 hartree
zpe.sumelectzpe: -1864.846811 hartree
zpe.sumelectthermal: -1864.814296 hartree
zpe.sumelectthermalent: -1864.813352 hartree
zpe.sumelectthermalfe: -1864.914049 hartree
dipole: 8.5041 7.0849 0.9422
dipole: 11.1087
quadrupole: -235.1029 -199.7573 -193.3852
quadrupole: -6.3138 -6.6727 0.8591
quadrupole: -25.6878 9.6578 16.0300 -6.3138 -6.6727 0.8591
hfenergy: -1865.2871825 hartree
pointgroup: C01 [X(C21H25F1N6O3S1)]
dipole: -3.1637601 2.9949134 -0.3498313 debye
polarizability: 358.0252285|20.2889146|402.5310085|24.7422736|6.5149484|213.254378 unknown
InChI: InChI=1S/C21H25FN6O3S/c1-13-12-15(7-10-17(13)32(22,30)31)25-18(29)11-6-14-4-8-16(9-5-14)28-20(24)26-19(23)27-21(28,2)3/h4-5,7-10,12,25H,6,11,23-24H2,1-3H3
charge 0 multiplicity 1
57 atoms
S  5.142383 -2.617339 0.443061
F  5.479025 -3.174647 -1.313718
O  3.016309 4.046122 0.259848
O  6.550082 -2.149744 1.062753
O  4.316173 -3.830437 1.101334
N  -3.343759 -0.420819 0.045026
N  -3.811152 -2.623373 -1.007685
N  -5.280644 -1.684399 0.720293
N  -4.909189 0.428044 1.624384
N  1.803398 2.295797 -0.733962
N  -5.883818 -3.585133 -0.485999
C  -2.749662 -1.685153 -0.63128
C  -2.601901 0.812295 0.100608
C  -2.003922 -1.275128 -1.916987
C  -1.776987 -2.362742 0.375929
C  -4.506185 -0.595426 0.790378
C  -1.133501 3.270049 0.196311
C  -2.772807 1.7945 -0.910317
C  -1.701233 1.075677 1.167027
C  -0.330654 4.563584 0.214315
C  -2.043744 3.001176 -0.862465
C  -0.980871 2.290311 1.211336
C  -4.919484 -2.616635 -0.276045
C  0.866473 4.573864 -0.796563
C  2.002824 3.638116 -0.377331
C  2.617442 1.175204 -0.447865
C  2.839955 -1.294585 -0.609409
C  4.090435 -1.128931 0.038226
C  2.121215 -0.101779 -0.836061
C  3.884296 1.2825 0.190384
C  4.625343 0.111665 0.427964
C  2.290682 -2.63262 -1.058563
H  -1.631451 -2.196358 -2.394853
H  -2.693851 -0.783139 -2.62269
H  -1.150893 -0.604073 -1.708246
H  -1.391206 -3.295729 -0.070667
H  -0.920034 -1.707453 0.621344
H  -2.311554 -2.625384 1.306065
H  -3.483916 1.599533 -1.719613
H  -1.5707 0.32651 1.955478
H  -0.985711 5.415173 -0.049829
H  0.064847 4.762602 1.22686
H  -2.19759 3.753156 -1.64698
H  -0.290095 2.477395 2.042233
H  1.293843 5.589585 -0.832582
H  0.495505 4.321782 -1.808639
H  -5.799612 0.303411 2.099327
H  -4.34188 1.255671 1.783785
H  0.909783 2.090904 -1.190273
H  -5.714022 -4.314658 -1.171886
H  -6.759607 -3.523659 0.023988
H  1.14587 -0.175577 -1.333287
H  4.261684 2.261078 0.488991
H  5.607195 0.163416 0.908935
H  1.297915 -2.511321 -1.520068
H  2.968375 -3.103581 -1.793489
H  2.204781 -3.335801 -0.211632
