program: Orca
programVersion: 5.0.2
elementType: F O O O O N C C C C C C C C C C C C C C C C C C C C C H H H H H H H H H H H H H H H H H H H H H H
charge: 0
multiplicity: 1
keywords: wb97x-d3
keywords: def2-TZVPP
keywords: def2/J RIJCOSX
keywords: DEFGRID2
keywords: scfconv7
keywords: smallprint printgap noloewdin
keywords: NOSOSCF
formula: C21H22FNO4
InChI: InChI=1/C21H22FNO4/c1-25-19-8-5-16(13-20(19)26-2)18(15-3-6-17(22)7-4-15)14-21(24)23-9-11-27-12-10-23/h3-8,13-14H,9-12H2,1-2H3
49 atoms
F  2.732572 4.04312 0.512566
O  4.71488 -0.631349 1.554611
O  2.254775 -2.125243 -2.353884
O  -4.5782 1.456781 -0.600555
O  -5.682134 -0.602871 0.47288
N  2.849103 -1.8338 -0.192842
C  2.560344 -1.690616 1.224263
C  4.275903 -1.885713 -0.473313
C  3.327966 -0.516298 1.803616
C  4.96579 -0.694838 0.165341
C  1.943736 -1.901474 -1.181649
C  -0.134916 -0.64986 -0.466429
C  0.497018 -1.765768 -0.856305
C  -1.588582 -0.667611 -0.200267
C  0.587081 0.623372 -0.250591
C  -2.37943 0.440749 -0.535058
C  -2.197387 -1.767748 0.383267
C  -3.742326 0.437205 -0.305838
C  0.383432 1.346299 0.925841
C  1.501979 1.111803 -1.182142
C  -4.350777 -0.691627 0.279905
C  -3.568463 -1.781952 0.61907
C  1.103302 2.499443 1.190903
C  2.227959 2.267755 -0.9359
C  2.022153 2.934708 0.2548
C  -4.023957 2.62993 -1.165705
C  -6.339202 -1.700613 1.079941
H  2.8596 -2.610487 1.736731
H  1.495401 -1.559026 1.395153
H  4.450675 -1.874374 -1.545723
H  4.690552 -2.817988 -0.077799
H  2.94522 0.423119 1.388032
H  3.187574 -0.487931 2.884868
H  6.044497 -0.779054 0.028734
H  4.631945 0.228926 -0.326946
H  -0.081591 -2.657743 -1.073323
H  -1.909755 1.30182 -0.991903
H  -1.607493 -2.623333 0.684812
H  -0.328051 0.992555 1.660805
H  1.647043 0.59786 -2.123307
H  -4.007169 -2.653815 1.084584
H  0.958241 3.045105 2.113834
H  2.936539 2.641051 -1.663576
H  -4.848275 3.326856 -1.297788
H  -3.567784 2.438109 -2.140117
H  -3.279655 3.087425 -0.50897
H  -5.958603 -1.898109 2.085085
H  -6.250813 -2.61051 0.481336
H  -7.389813 -1.429927 1.151757
elementType: F O N C H
totalener: -1269.07295052 hartree
nucrepener: 2508.86572402 hartree
electener: -3777.93867454 hartree
oneelecener: -6718.44385315 hartree
twoeener: 2940.50517861 hartree
cpcmener: -0.04891297 hartree
kineticenergy: 1263.68995145 hartree
xcener: -120.375732425789 hartree
chargesum: 0.0000000
charge: -0.222910 -0.401569 -0.573925 -0.344019 -0.341308 -0.079141 -0.102227 -0.067156 0.079073 0.009233 0.275882 0.098144 -0.112366 -0.013738 0.088826 -0.229335 -0.239383 0.229232 -0.216582 -0.194812 0.244821 -0.213023 -0.201092 -0.227512 0.348979 -0.127905 -0.127799 0.115584 0.120000 0.096594 0.109862 0.028067 0.114409 0.109209 0.086796 0.133154 0.146261 0.150795 0.154039 0.150229 0.141398 0.149618 0.153295 0.124754 0.114304 0.111338 0.113602 0.113779 0.124528
qa: -0.2229 -0.4016 -0.5739 -0.3440 -0.3413 -0.0791 -0.1022 -0.0672 0.0791 0.0092 0.2759 0.0981 -0.1124 -0.0137 0.0888 -0.2293 -0.2394 0.2292 -0.2166 -0.1948 0.2448 -0.2130 -0.2011 -0.2275 0.3490 -0.1279 -0.1278 0.1156 0.1200 0.0966 0.1099 0.0281 0.1144 0.1092 0.0868 0.1332 0.1463 0.1508 0.1540 0.1502 0.1414 0.1496 0.1533 0.1248 0.1143 0.1113 0.1136 0.1138 0.1245
va: 1.0585 1.9236 1.9092 2.0448 2.0418 3.1298 3.8851 3.8292 3.8971 3.9559 4.1797 3.4037 3.7888 3.5436 3.3382 3.8774 4.0097 3.9152 3.8767 3.8633 3.8973 3.8988 3.8991 3.8842 3.8360 3.8724 3.8701 1.0092 1.0018 1.0436 1.0057 1.0656 0.9996 0.9994 0.9994 1.0118 1.0040 1.0015 0.9975 1.0253 1.0114 0.9999 0.9987 0.9933 0.9866 0.9876 0.9867 0.9864 0.9935
dispcorr: -0.027440485 hartree
energy: -1269.100391000127
dipole: -5.76895 4.89303 -0.87592 -9.21149 9.13543 -0.07606 4.06127 -2.23310 1.82817
magnitude: 2.02860 au
magnitude: 5.15630 debye
