program: Orca
programVersion: 5.0.2
elementType: F O O O O N C C C C C C C C C C C C C C C C C C C C C H H H H H H H H H H H H H H H H H H H H H H
charge: 0
multiplicity: 1
keywords: wb97x-d3
keywords: def2-TZVPP
keywords: def2/J RIJCOSX
keywords: DEFGRID2
keywords: scfconv7
keywords: smallprint printgap noloewdin
keywords: NOSOSCF
formula: C21H22FNO4
InChI: InChI=1/C21H22FNO4/c1-25-19-8-5-16(13-20(19)26-2)18(15-3-6-17(22)7-4-15)14-21(24)23-9-11-27-12-10-23/h3-8,13-14H,9-12H2,1-2H3
49 atoms
F  2.278275 4.757004 -2.38261
O  4.501391 -3.746718 0.706196
O  2.517556 0.609456 1.619246
O  -4.363619 -1.3009 1.781446
O  -5.597803 -0.532238 -0.33403
N  3.001608 -1.370806 0.644058
C  2.662895 -2.480306 -0.227478
C  4.406748 -1.338454 1.005375
C  3.125084 -3.782935 0.397984
C  4.809724 -2.683444 1.582073
C  2.15316 -0.387821 1.00562
C  -0.049975 0.294573 0.0423
C  0.713869 -0.600981 0.684143
C  -1.509646 0.112781 -0.075267
C  0.551126 1.47814 -0.613611
C  -2.23424 -0.508881 0.952957
C  -2.191941 0.532146 -1.207098
C  -3.59454 -0.719246 0.842298
C  1.614728 1.331651 -1.501698
C  0.066443 2.760167 -0.356549
C  -4.275357 -0.29643 -0.319797
C  -3.562911 0.324607 -1.330923
C  2.203807 2.432752 -2.102895
C  0.647233 3.873335 -0.942671
C  1.710528 3.686853 -1.805946
C  -3.744375 -1.753517 2.967416
C  -6.341939 -0.113064 -1.460194
H  3.151354 -2.339375 -1.198293
H  1.590977 -2.518757 -0.411575
H  4.587734 -0.556206 1.738912
H  5.009218 -1.110949 0.119031
H  2.530159 -3.988668 1.2991
H  2.968475 -4.60602 -0.301236
H  5.887653 -2.704102 1.751051
H  4.315586 -2.827308 2.553113
H  0.267233 -1.513542 1.065417
H  -1.713846 -0.803524 1.854723
H  -1.664233 1.01219 -2.020658
H  1.983155 0.342741 -1.745194
H  -0.766006 2.897464 0.322166
H  -4.059372 0.657522 -2.232432
H  3.027909 2.314131 -2.794503
H  0.278418 4.868379 -0.72913
H  -3.288669 -0.935263 3.531602
H  -2.984687 -2.51484 2.768808
H  -4.530173 -2.197548 3.575061
H  -6.013926 -0.610267 -2.377126
H  -6.291174 0.969528 -1.604862
H  -7.376016 -0.389809 -1.266166
elementType: F O N C H
totalener: -1269.08059161 hartree
nucrepener: 2423.95942591 hartree
electener: -3693.04001752 hartree
oneelecener: -6549.45663851 hartree
twoeener: 2856.41662098 hartree
cpcmener: -0.04399230 hartree
kineticenergy: 1263.70000384 hartree
xcener: -120.370525830889 hartree
chargesum: -0.0000000
charge: -0.222550 -0.377513 -0.521727 -0.325683 -0.322029 -0.060243 -0.085591 -0.059971 0.023919 0.011925 0.235252 0.229181 -0.219844 -0.061158 -0.016894 -0.211735 -0.236744 0.221249 -0.138593 -0.182384 0.245915 -0.209394 -0.219590 -0.206356 0.309652 -0.132630 -0.130309 0.103934 0.116897 0.097499 0.103130 0.081095 0.099539 0.099471 0.082024 0.151040 0.136523 0.152010 0.159760 0.151926 0.138829 0.147576 0.149647 0.112392 0.110969 0.123065 0.112091 0.111973 0.122456
qa: -0.2225 -0.3775 -0.5217 -0.3257 -0.3220 -0.0602 -0.0856 -0.0600 0.0239 0.0119 0.2353 0.2292 -0.2198 -0.0612 -0.0169 -0.2117 -0.2367 0.2212 -0.1386 -0.1824 0.2459 -0.2094 -0.2196 -0.2064 0.3097 -0.1326 -0.1303 0.1039 0.1169 0.0975 0.1031 0.0811 0.0995 0.0995 0.0820 0.1510 0.1365 0.1520 0.1598 0.1519 0.1388 0.1476 0.1496 0.1124 0.1110 0.1231 0.1121 0.1120 0.1225
va: 1.0554 1.9370 1.9816 2.0643 2.0643 3.1042 3.8640 3.8264 3.9531 3.9687 4.2443 3.3584 3.6939 3.6299 3.4522 3.8967 4.0145 3.9447 3.8697 3.9241 3.9122 3.8952 3.9290 3.9032 3.8957 3.8783 3.8760 1.0064 1.0048 1.0420 1.0060 1.0065 0.9977 0.9980 1.0034 1.0000 1.0144 0.9972 0.9899 0.9975 1.0116 1.0007 0.9988 0.9860 0.9870 0.9939 0.9860 0.9868 0.9939
dispcorr: -0.023660092 hartree
energy: -1269.104251706259
dipole: -5.09183 4.03237 -1.05946 -20.06897 18.32087 -1.74810 6.00614 -6.74381 -0.73768
magnitude: 2.17312 au
magnitude: 5.52364 debye
