program: Gaussian 09
title: 000064675
version: EM64L-G09RevD.01
frameworkgroup: C1[X(C18H36N2O)]
method: RPBEPBE
basis: SDD
operation: Freq
keyword: #p
keyword: freq=noraman
keyword: PBEPBE/SDD
title: #p freq=noraman PBEPBE/SDD
converged: YES YES NO NO
title: Mulliken charges:
elementType: O N N C C C C C C C C C C C C C C C C C C H H H H H H H H H H H H H H H H H H H H H H H H H H H H H H H H H H H H
charge: -0.448504 -0.209117 -0.113713 -0.391190 -0.382612 -0.361430 -0.388631 -0.383547 -0.383642 -0.470516 -0.386662 0.204735 -0.380363 -0.373112 -0.373884 -0.494043 -0.387342 -0.352473 -0.357166 -0.317126 -0.696710 0.196224 0.196052 0.193094 0.194335 0.195404 0.190425 0.193311 0.195458 0.195452 0.224348 0.192010 0.194147 0.201606 0.238044 0.194242 0.192200 0.190595 0.192374 0.207714 0.226694 0.190009 0.188789 0.224005 0.223946 0.237918 0.234347 0.187788 0.186954 0.194789 0.194692 0.196408 0.201628 0.209622 0.209536 0.214770 0.348120
chargesum: 0.00000
title: Mulliken charges with hydrogens summed into heavy atoms:
elementType: O N N C C C C C C C C C C C C C C C C C C
charge: -0.100384 -0.209117 -0.113713 0.001086 0.004817 0.024398 0.000137 0.036254 0.002515 -0.030867 -0.000220 0.204735 0.002606 0.061296 0.004915 -0.046092 0.084923 0.022270 0.032315 0.080910 -0.062781
polarizability: 2.71498890e+02 -7.96397098e+00 1.99322274e+02 5.69595275e+00 8.35551194e-01 1.73742145e+02
1716.lowfreq: -8.9759 -3.3052 -0.0024 0.0007 0.0016 7.3369 11.6486 16.1330 24.3175
frequency: 8.1233 15.7832 24.2639 37.0214 44.5289 51.1720 60.0638 65.3676 67.0596 86.6183 89.5472 91.1613 93.8896 114.1454 121.5791 123.8040 132.2270 144.5354 146.3999 159.6695 164.3965 219.5108 237.0713 253.2967 266.1659 282.4311 295.2545 301.2917 350.4973 364.6364 400.8704 413.1259 433.7253 483.1575 495.4601 626.4871 673.6328 719.2889 720.8746 723.8662 729.8990 733.6442 744.3101 764.0550 776.6924 803.9710 806.1981 831.0652 847.1882 888.3088 891.0987 925.8084 946.1353 955.4881 972.3232 974.1755 984.2787 989.1429 992.0932 997.7634 1009.0188 1028.2593 1029.9507 1033.2732 1058.3248 1072.3375 1075.1878 1078.5160 1080.7486 1081.7485 1086.5087 1094.3697 1123.4635 1132.9443 1163.5475 1179.8985 1185.8285 1197.6661 1199.3452 1206.3308 1214.1208 1223.4286 1224.6485 1243.8363 1248.3257 1253.8523 1260.3379 1271.0527 1272.4699 1276.6914 1281.8722 1283.8021 1287.8342 1290.2617 1291.7160 1293.8093 1296.4850 1297.4321 1304.8753 1318.5517 1333.8000 1338.8906 1345.3259 1352.1003 1352.6714 1355.6797 1356.1986 1390.7663 1407.5844 1417.8466 1455.3731 1458.9483 1459.0810 1461.8242 1462.3814 1464.2167 1466.6707 1468.6339 1471.0741 1473.6471 1476.2290 1478.0855 1480.5513 1484.2901 1484.7085 1487.2604 1489.2984 1501.1548 1587.3062 2941.2191 2947.2708 2947.2763 2947.6275 2949.0607 2949.5945 2950.9944 2951.8832 2955.4676 2959.7379 2963.6291 2967.4926 2971.3673 2976.6250 2980.4854 2983.0728 2986.3428 2987.2939 2991.5377 2994.0275 2995.1199 2997.3989 3006.2486 3010.0044 3015.6699 3017.6154 3024.9758 3033.2732 3039.8209 3044.3322 3055.7342 3067.9232 3069.8522 3072.7607 3076.8242 3576.2697
redmass: 4.0244 3.6822 4.4375 1.8851 3.3434 3.5460 1.9177 3.3136 3.5601 2.4762 2.7665 2.0742 2.2526 2.0945 1.7636 2.4012 3.9027 1.7905 2.3490 2.1934 3.1646 3.3386 1.1173 2.9592 1.1787 3.0801 3.2411 3.1431 3.3311 3.9781 3.3896 3.0265 3.0858 3.1157 2.9891 4.5571 4.3583 1.0582 1.0642 1.0751 1.1716 3.4271 1.2177 1.5705 1.8152 1.2629 1.1763 1.4988 1.2775 1.8615 1.3986 1.8776 2.4618 1.7606 3.8282 4.3485 4.3823 3.4178 2.2195 1.6711 3.6951 1.9038 1.6052 2.8733 2.9836 2.5952 2.1187 1.9317 2.1046 2.1653 2.5397 1.5529 2.8586 1.6676 1.1617 1.8473 1.4507 1.3145 1.4581 1.2401 1.2464 1.4322 1.3022 1.3840 1.3227 2.3969 1.3710 1.2899 1.2972 1.0300 1.0510 1.2076 1.1232 1.1694 1.1895 1.1418 1.1304 1.2810 1.3280 1.3979 1.4395 1.2854 1.4831 1.5823 1.7094 1.6572 1.6405 1.2180 1.4207 2.4147 1.1308 1.0739 1.0763 1.0726 1.0701 1.0673 1.0835 1.1047 1.0860 1.0795 1.0860 1.0424 1.0891 1.0879 1.0865 1.0967 1.0934 1.1305 7.2419 1.0592 1.0600 1.0590 1.0585 1.0590 1.0590 1.0592 1.0595 1.0594 1.0591 1.0585 1.0585 1.0367 1.0603 1.0960 1.0967 1.0905 1.0740 1.0984 1.0701 1.1041 1.1009 1.1030 1.0617 1.1040 1.0918 1.1043 1.1040 1.1037 1.1032 1.1040 1.1005 1.0994 1.1024 1.1002 1.0668
irintensity: 0.1498 0.0899 0.2058 0.0041 0.1286 0.4692 0.5645 1.5239 2.1802 10.3184 0.1767 0.4645 2.7286 0.2545 0.0123 0.0543 0.5093 0.0098 0.1150 0.2981 1.4200 1.3377 0.0133 15.4849 136.4563 16.2440 2.5020 8.8056 4.6556 9.3852 0.5875 0.9513 2.3710 0.3608 0.4919 7.7649 16.1850 19.1400 0.2495 7.4451 0.4388 0.8280 1.5030 0.4008 4.6848 0.8338 3.2346 2.7981 4.3228 4.5399 4.2241 13.6253 9.1551 7.6186 77.2602 13.5739 0.4674 8.2341 6.5083 2.7892 7.2530 1.1379 1.7029 0.4812 0.2814 0.4299 0.4019 0.2053 0.2348 0.1196 2.0698 9.8088 15.2618 2.8684 4.2458 1.3981 9.3953 23.0281 8.6945 26.9223 1.8311 1.7456 0.3289 9.8447 0.6626 10.6444 29.5343 4.2812 21.4519 2.7218 0.6459 13.2079 4.1058 4.4914 2.9616 0.5157 0.1950 2.0790 2.3635 2.0634 1.3627 0.7401 1.5503 0.1304 0.0951 0.0227 0.6169 11.3435 3.5878 72.8438 22.7414 0.0308 0.7905 0.0308 0.8741 0.0411 0.4821 1.1741 1.8125 5.2523 0.9253 12.2291 1.3874 0.9410 8.2273 12.7930 38.7718 14.3415 141.4462 49.9850 51.3438 14.6639 0.0085 0.4167 0.2908 3.2041 0.0966 4.0363 0.4586 142.6815 194.8282 37.1798 32.4962 0.0819 0.2516 8.2979 37.4111 2.5495 40.6003 69.2665 1.5060 0.7449 38.8867 0.2113 55.1795 4.2802 2.0075 73.2778 272.7473 46.5474 94.1418 58.2453 53.8833 28.0923 3.1314
temp: 298.150 k
press: 1.00000 atm
elementType: 8 7 7 6 6 6 6 6 6 6 6 6 6 6 6 6 6 6 6 6 6 1 1 1 1 1 1 1 1 1 1 1 1 1 1 1 1 1 1 1 1 1 1 1 1 1 1 1 1 1 1 1 1 1 1 1 1
symmnumber: 1
zpe: 1348046.3 jmol-1
zpe.correction: 0.513444 hartree
zpe.thermalcorrener: 0.540381 hartree
zpe.thermalcorrenthalpy: 0.541325 hartree
zpe.thermalcorrgfe: 0.450131 hartree
zpe.sumelectzpe: -890.479951 hartree
zpe.sumelectthermal: -890.453014 hartree
zpe.sumelectthermalent: -890.452070 hartree
zpe.sumelectthermalfe: -890.543264 hartree
dipole: 1.3853 2.4307 0.0501
dipole: 2.7982
quadrupole: -113.2114 -138.8382 -133.9367
quadrupole: 16.9614 0.5064 -9.1797
quadrupole: 15.4507 -10.1761 -5.2746 16.9614 0.5064 -9.1797
hfenergy: -890.9933949 hartree
pointgroup: C01 [X(C18H36N2O1)]
dipole: 0.5435698 0.9563943 0.0428756 debye
polarizability: 271.5305437|-7.9890393|199.2409059|5.435432|1.4765364|173.7918594 unknown
InChI: InChI=1S/C18H36N2O/c1-2-3-4-5-6-7-8-9-10-11-12-13-18-19-14-15-20(18)16-17-21/h21H,2-17H2,1H3
charge 0 multiplicity 1
57 atoms
O  6.116724 3.604059 0.129614
N  5.89023 -0.104587 0.534235
N  5.74214 -2.109886 -0.610259
C  0.130148 -0.365053 0.145436
C  -1.19702 -0.046788 -0.579887
C  1.364967 -0.244727 -0.776164
C  -2.445261 -0.198831 0.31851
C  2.692692 -0.598008 -0.070581
C  -3.766455 0.103957 -0.423971
C  3.911447 -0.481131 -1.027946
C  -5.026416 -0.095811 0.448051
C  5.209765 -0.919839 -0.393312
C  -6.341952 0.199754 -0.307281
C  7.150622 -0.787701 0.929206
C  -7.609516 -0.039126 0.543702
C  6.958888 -2.201173 0.272515
C  5.683152 1.326339 0.75099
C  -8.921559 0.251617 -0.219527
C  -10.192439 -0.005979 0.621734
C  6.41755 2.221574 -0.271395
C  -11.497021 0.281406 -0.152868
H  0.082913 -1.393446 0.560573
H  0.248901 0.316298 1.013595
H  -1.299341 -0.716134 -1.459784
H  -1.157209 0.987977 -0.98059
H  1.23164 -0.91262 -1.652596
H  1.422927 0.788986 -1.177962
H  -2.481061 -1.232746 0.721637
H  -2.353007 0.474115 1.196538
H  2.832775 0.061242 0.809827
H  2.647699 -1.634852 0.315679
H  -3.83725 -0.548502 -1.319693
H  -3.743484 1.147583 -0.802381
H  3.986162 0.559703 -1.401586
H  3.748285 -1.135783 -1.901264
H  -4.962465 0.556149 1.34441
H  -5.047804 -1.140101 0.824755
H  -6.389184 -0.434559 -1.217493
H  -6.331777 1.251446 -0.663265
H  8.038677 -0.256816 0.526061
H  7.249104 -0.833027 2.029824
H  -7.566665 0.594873 1.45424
H  -7.618437 -1.091241 0.898651
H  6.784936 -2.982189 1.036799
H  7.833806 -2.509493 -0.3262
H  4.605358 1.562363 0.711879
H  6.032561 1.598464 1.764197
H  -8.919712 1.306918 -0.56499
H  -8.958234 -0.374109 -1.136145
H  -10.157873 0.621306 1.536062
H  -10.191464 -1.059716 0.968569
H  7.510209 2.024731 -0.241534
H  6.046284 2.0082 -1.296419
H  -11.570703 -0.356549 -1.053974
H  -11.5357 1.335979 -0.485825
H  -12.390341 0.090773 0.470215
H  6.559687 4.237109 -0.488515
