program: Orca
programVersion: 5.0.2
elementType: F O O O O N C C C C C C C C C C C C C C C C C C C C C H H H H H H H H H H H H H H H H H H H H H H
charge: 0
multiplicity: 1
keywords: wb97x-d3
keywords: def2-TZVPP
keywords: def2/J RIJCOSX
keywords: DEFGRID2
keywords: scfconv7
keywords: smallprint printgap noloewdin
keywords: NOSOSCF
formula: C21H22FNO4
InChI: InChI=1/C21H22FNO4/c1-25-19-8-5-16(13-20(19)26-2)18(15-3-6-17(22)7-4-15)14-21(24)23-9-11-27-12-10-23/h3-8,13-14H,9-12H2,1-2H3
49 atoms
F  2.701732 4.061494 0.488921
O  4.730522 -0.667604 1.577661
O  2.257981 -2.152784 -2.350603
O  -4.571654 1.4564 -0.595131
O  -5.677917 -0.594975 0.483901
N  2.854145 -1.787835 -0.20287
C  2.565964 -1.690485 1.216854
C  4.278365 -1.860243 -0.484779
C  3.347656 -0.542352 1.828916
C  4.988671 -0.7015 0.191303
C  1.946198 -1.906179 -1.188362
C  -0.134644 -0.65718 -0.46801
C  0.498413 -1.771857 -0.861084
C  -1.588672 -0.674336 -0.201193
C  0.58446 0.618518 -0.252792
C  -2.378749 0.434999 -0.536009
C  -2.199044 -1.770784 0.386843
C  -3.740951 0.437682 -0.302816
C  0.379118 1.344588 0.921261
C  1.492376 1.112001 -1.188633
C  -4.351664 -0.689022 0.287709
C  -3.570038 -1.780182 0.626332
C  1.089174 2.505446 1.179364
C  2.208363 2.275278 -0.949434
C  2.001159 2.945501 0.23908
C  -4.023252 2.624279 -1.170531
C  -6.344584 -1.687687 1.083432
H  2.854976 -2.629856 1.701424
H  1.502557 -1.550251 1.391538
H  4.451944 -1.818814 -1.557256
H  4.676781 -2.812591 -0.118328
H  2.972406 0.412477 1.439098
H  3.209016 -0.540244 2.911298
H  6.067137 -0.804483 0.060755
H  4.680376 0.241597 -0.281628
H  -0.081667 -2.661697 -1.083547
H  -1.907842 1.293283 -0.996977
H  -1.611025 -2.627577 0.689813
H  -0.328465 0.989425 1.659784
H  1.639221 0.595944 -2.128578
H  -4.009282 -2.650382 1.095234
H  0.94032 3.054384 2.09997
H  2.910613 2.652546 -1.681662
H  -4.849974 3.318953 -1.30412
H  -3.571969 2.428927 -2.147314
H  -3.276742 3.090759 -0.521545
H  -5.973682 -1.892014 2.091556
H  -6.2628 -2.597996 0.483243
H  -7.394133 -1.409254 1.150628
elementType: F O N C H
totalener: -1269.07984521 hartree
nucrepener: 2507.30490032 hartree
electener: -3776.38474553 hartree
oneelecener: -6715.27028299 hartree
twoeener: 2938.88553746 hartree
cpcmener: -0.03913096 hartree
kineticenergy: 1263.70012001 hartree
xcener: -120.374914868216 hartree
chargesum: 0.0000000
charge: -0.220608 -0.383153 -0.529595 -0.326055 -0.323285 -0.081049 -0.104497 -0.071363 0.066920 0.009183 0.250234 0.098157 -0.109064 -0.008939 0.084222 -0.233023 -0.238493 0.227709 -0.217656 -0.190026 0.240652 -0.213380 -0.199218 -0.227860 0.344544 -0.130585 -0.130887 0.113438 0.117617 0.097832 0.106791 0.036545 0.109797 0.105234 0.081634 0.129187 0.143357 0.147484 0.152096 0.149469 0.137375 0.147427 0.150924 0.123195 0.112495 0.109119 0.111234 0.111764 0.123100
qa: -0.2206 -0.3832 -0.5296 -0.3261 -0.3233 -0.0810 -0.1045 -0.0714 0.0669 0.0092 0.2502 0.0982 -0.1091 -0.0089 0.0842 -0.2330 -0.2385 0.2277 -0.2177 -0.1900 0.2407 -0.2134 -0.1992 -0.2279 0.3445 -0.1306 -0.1309 0.1134 0.1176 0.0978 0.1068 0.0365 0.1098 0.1052 0.0816 0.1292 0.1434 0.1475 0.1521 0.1495 0.1374 0.1474 0.1509 0.1232 0.1125 0.1091 0.1112 0.1118 0.1231
va: 1.0614 1.9415 1.9671 2.0659 2.0625 3.0976 3.8840 3.8324 3.9135 3.9656 4.2091 3.3948 3.7835 3.5488 3.3476 3.8759 4.0160 3.9222 3.8763 3.8666 3.9085 3.9016 3.8986 3.8851 3.8475 3.8784 3.8768 1.0093 1.0026 1.0425 1.0058 1.0564 0.9994 0.9993 1.0001 1.0137 1.0047 1.0026 0.9984 1.0240 1.0124 1.0006 0.9995 0.9938 0.9865 0.9874 0.9864 0.9863 0.9940
dispcorr: -0.027347694 hartree
energy: -1269.107192904174
dipole: -5.70556 4.76679 -0.93877 -9.22489 9.18835 -0.03654 4.09542 -2.44651 1.64891
magnitude: 1.89777 au
magnitude: 4.82376 debye
