program: Orca
programVersion: 5.0.2
elementType: Cl O O O O N C C C C C C C C C C C C C C C C C C C C C H H H H H H H H H H H H H H H H H H H H H H
charge: 0
multiplicity: 1
keywords: wb97x-d3
keywords: def2-TZVPP
keywords: def2/J RIJCOSX
keywords: DEFGRID2
keywords: scfconv7
keywords: smallprint printgap noloewdin
keywords: NOSOSCF
formula: C21H22ClNO4
InChI: InChI=1/C21H22ClNO4/c1-25-19-8-5-16(13-20(19)26-2)18(15-3-6-17(22)7-4-15)14-21(24)23-9-11-27-12-10-23/h3-8,13-14H,9-12H2,1-2H3
49 atoms
Cl -6.76323 0.458212 0.05456
O  3.753655 -1.483437 1.98242
O  1.213344 -2.815235 -1.938066
O  3.165801 1.729921 -1.654351
O  2.926691 3.356446 0.324503
N  1.762891 -2.434558 0.218836
C  1.445672 -2.111186 1.599759
C  3.160867 -2.786037 0.024456
C  2.409786 -1.071915 2.13819
C  4.048909 -1.710728 0.619781
C  0.905596 -2.418671 -0.81132
C  -0.898176 -0.707873 -0.344832
C  -0.495617 -1.962733 -0.592718
C  0.053549 0.410895 -0.186123
C  -2.34159 -0.410027 -0.218017
C  1.131651 0.557313 -1.067502
C  -0.075544 1.304485 0.86613
C  2.082673 1.540259 -0.870973
C  -3.213261 -1.315831 0.386702
C  -2.868474 0.780093 -0.719948
C  1.954159 2.430319 0.214123
C  0.868825 2.306946 1.066125
C  -4.571212 -1.057928 0.472112
C  -4.22473 1.051618 -0.645068
C  -5.067099 0.125947 -0.049668
C  3.369624 0.835117 -2.732598
C  2.85142 4.277107 1.39734
H  1.522634 -3.024521 2.198171
H  0.425424 -1.748792 1.690119
H  3.379219 -2.887747 -1.035272
H  3.363638 -3.750393 0.50051
H  2.245121 -0.110334 1.637038
H  2.229609 -0.931537 3.204596
H  5.091362 -2.024234 0.556405
H  3.937252 -0.782178 0.042906
H  -1.235202 -2.73431 -0.779902
H  1.206031 -0.098387 -1.923994
H  -0.90146 1.219326 1.560162
H  -2.830419 -2.232239 0.816494
H  -2.21858 1.505191 -1.192205
H  0.745472 2.979201 1.904075
H  -5.229422 -1.770314 0.950431
H  -4.615655 1.974516 -1.050772
H  2.569867 0.901934 -3.47456
H  3.45238 -0.201571 -2.393764
H  4.306157 1.12653 -3.201967
H  1.947457 4.888761 1.346925
H  3.718587 4.926585 1.30599
H  2.888342 3.775114 2.367208
elementType: Cl O N C H
totalener: -1629.42828065 hartree
nucrepener: 2668.49566657 hartree
electener: -4297.92394722 hartree
oneelecener: -7533.64773634 hartree
twoeener: 3235.72378912 hartree
cpcmener: -0.04685856 hartree
kineticenergy: 1623.69820577 hartree
xcener: -133.901000750173 hartree
chargesum: -0.0000000
charge: -0.097827 -0.403670 -0.573031 -0.346538 -0.341781 -0.066578 -0.112555 -0.081836 0.092489 0.022893 0.278505 0.113639 -0.115333 0.060054 0.009259 -0.232202 -0.274434 0.210047 -0.188747 -0.193128 0.267491 -0.190134 -0.174988 -0.170253 0.124349 -0.121813 -0.127579 0.114065 0.119479 0.099490 0.113963 0.029207 0.113266 0.110464 0.078532 0.132196 0.134745 0.148982 0.153394 0.158437 0.141873 0.144148 0.144237 0.121255 0.096109 0.127366 0.113703 0.124522 0.114267
qa: -0.0978 -0.4037 -0.5730 -0.3465 -0.3418 -0.0666 -0.1126 -0.0818 0.0925 0.0229 0.2785 0.1136 -0.1153 0.0601 0.0093 -0.2322 -0.2744 0.2100 -0.1887 -0.1931 0.2675 -0.1901 -0.1750 -0.1703 0.1243 -0.1218 -0.1276 0.1141 0.1195 0.0995 0.1140 0.0292 0.1133 0.1105 0.0785 0.1322 0.1347 0.1490 0.1534 0.1584 0.1419 0.1441 0.1442 0.1213 0.0961 0.1274 0.1137 0.1245 0.1143
va: 1.2075 1.9269 1.9086 2.0317 2.0410 3.1341 3.9083 3.8313 3.8867 3.9781 4.1695 3.4032 3.8070 3.3905 3.4872 3.8407 3.9781 3.8809 4.0005 3.9836 3.8538 3.8722 4.0219 4.0098 3.8056 3.8698 3.8698 1.0079 1.0029 1.0396 1.0064 1.0537 1.0001 1.0003 0.9970 1.0108 1.0404 0.9995 0.9990 0.9935 1.0103 1.0081 1.0074 0.9875 0.9863 0.9936 0.9870 0.9934 0.9863
dispcorr: -0.029337129 hartree
energy: -1629.457617783080
dipole: 33.92138 -33.65991 0.26147 0.49360 0.24153 0.73513 4.82340 -2.98976 1.83364
magnitude: 1.99274 au
magnitude: 5.06514 debye
