program: Orca
programVersion: 5.0.2
elementType: Cl O O O O N C C C C C C C C C C C C C C C C C C C C C H H H H H H H H H H H H H H H H H H H H H H
charge: 0
multiplicity: 1
keywords: wb97x-d3
keywords: def2-TZVPP
keywords: def2/J RIJCOSX
keywords: DEFGRID2
keywords: scfconv7
keywords: smallprint printgap noloewdin
keywords: NOSOSCF
formula: C21H22ClNO4
InChI: InChI=1/C21H22ClNO4/c1-25-19-8-5-16(13-20(19)26-2)18(15-3-6-17(22)7-4-15)14-21(24)23-9-11-27-12-10-23/h3-8,13-14H,9-12H2,1-2H3
49 atoms
Cl -6.259206 0.311782 -1.685307
O  4.02918 -3.302298 -0.267649
O  0.786837 -2.278022 3.110012
O  1.436788 2.903115 -2.031535
O  2.896474 3.630751 -0.048521
N  1.915007 -2.103178 1.158249
C  1.985693 -1.985949 -0.285575
C  3.217241 -2.286857 1.774293
C  2.753797 -3.169434 -0.853225
C  3.938122 -3.456864 1.131971
C  0.796312 -2.042986 1.90405
C  -0.801066 -0.544321 0.645108
C  -0.494891 -1.704317 1.244313
C  0.165287 0.566422 0.519286
C  -2.150088 -0.337931 0.072569
C  0.312597 1.213099 -0.716304
C  0.941734 0.983387 1.587208
C  1.229654 2.232096 -0.882497
C  -2.83213 -1.378519 -0.557827
C  -2.769111 0.91061 0.141964
C  2.032101 2.634086 0.207222
C  1.873529 2.006846 1.430517
C  -4.095209 -1.189825 -1.094179
C  -4.032809 1.114782 -0.386887
C  -4.686686 0.060136 -1.004429
C  0.625747 2.585359 -3.144265
C  3.740088 4.074524 0.994761
H  2.48445 -1.049571 -0.556402
H  0.989822 -1.974028 -0.721934
H  3.107239 -2.460027 2.841973
H  3.80069 -1.368889 1.640301
H  2.165108 -4.08651 -0.710575
H  2.900257 -3.028567 -1.925348
H  4.956156 -3.521215 1.519249
H  3.421005 -4.392424 1.386731
H  -1.27035 -2.447835 1.396682
H  -0.296855 0.890861 -1.550502
H  0.819638 0.53688 2.565296
H  -2.365665 -2.350624 -0.654919
H  -2.26757 1.739866 0.623849
H  2.459548 2.311207 2.287273
H  -4.602354 -2.008136 -1.587182
H  -4.498624 2.088528 -0.317036
H  -0.436412 2.74218 -2.935771
H  0.772499 1.55497 -3.480112
H  0.925581 3.25681 -3.946076
H  3.173446 4.479385 1.837636
H  4.354454 4.86897 0.576242
H  4.397035 3.278936 1.356712
elementType: Cl O N C H
totalener: -1629.43604587 hartree
nucrepener: 2616.12415157 hartree
electener: -4245.56019744 hartree
oneelecener: -7428.84099601 hartree
twoeener: 3183.28079857 hartree
cpcmener: -0.03905645 hartree
kineticenergy: 1623.69230971 hartree
xcener: -133.894676938847 hartree
chargesum: -0.0000000
charge: -0.095399 -0.378844 -0.531464 -0.326553 -0.322659 -0.063991 -0.082266 -0.059082 0.008762 0.021138 0.241006 0.117665 -0.113009 0.036523 0.024071 -0.268030 -0.240250 0.239794 -0.186509 -0.194356 0.235272 -0.196134 -0.175229 -0.165156 0.123449 -0.131872 -0.131956 0.099932 0.116120 0.098216 0.095779 0.082988 0.101030 0.099682 0.081798 0.126900 0.142522 0.146747 0.150785 0.154475 0.140883 0.141728 0.142000 0.111074 0.111223 0.123561 0.111864 0.123205 0.112564
qa: -0.0954 -0.3788 -0.5315 -0.3266 -0.3227 -0.0640 -0.0823 -0.0591 0.0088 0.0211 0.2410 0.1177 -0.1130 0.0365 0.0241 -0.2680 -0.2402 0.2398 -0.1865 -0.1944 0.2353 -0.1961 -0.1752 -0.1652 0.1234 -0.1319 -0.1320 0.0999 0.1161 0.0982 0.0958 0.0830 0.1010 0.0997 0.0818 0.1269 0.1425 0.1467 0.1508 0.1545 0.1409 0.1417 0.1420 0.1111 0.1112 0.1236 0.1119 0.1232 0.1126
va: 1.2096 1.9370 1.9668 2.0675 2.0634 3.0869 3.8552 3.8161 3.9905 3.9666 4.2319 3.4022 3.7875 3.4197 3.4782 3.8603 3.9670 3.9112 4.0033 3.9813 3.9154 3.8664 4.0273 4.0106 3.8174 3.8796 3.8763 1.0021 1.0027 1.0447 1.0104 1.0058 0.9964 0.9969 1.0042 1.0151 1.0055 1.0224 0.9995 0.9952 1.0093 1.0087 1.0079 0.9873 0.9861 0.9938 0.9862 0.9937 0.9869
dispcorr: -0.026441871 hartree
energy: -1629.462487740671
dipole: 32.11587 -31.34617 0.76971 -1.26311 1.71271 0.44960 1.89370 -3.27098 -1.37728
magnitude: 1.64057 au
magnitude: 4.17001 debye
