program: Orca
programVersion: 5.0.2
elementType: Cl O O O O N C C C C C C C C C C C C C C C C C C C C C H H H H H H H H H H H H H H H H H H H H H H
charge: 0
multiplicity: 1
keywords: wb97x-d3
keywords: def2-TZVPP
keywords: def2/J RIJCOSX
keywords: DEFGRID2
keywords: scfconv7
keywords: smallprint printgap noloewdin
keywords: NOSOSCF
formula: C21H22ClNO4
InChI: InChI=1/C21H22ClNO4/c1-25-19-8-5-16(13-20(19)26-2)18(15-3-6-17(22)7-4-15)14-21(24)23-9-11-27-12-10-23/h3-8,13-14H,9-12H2,1-2H3
49 atoms
Cl -3.05157 -4.003791 0.337005
O  -4.532112 1.190946 1.549131
O  -1.904613 2.61828 -2.285405
O  4.55745 -1.646671 -0.637363
O  5.855843 0.271892 0.480985
N  -2.544644 2.264818 -0.14764
C  -2.282026 2.041939 1.264293
C  -3.957427 2.464833 -0.43425
C  -3.165112 0.928638 1.796334
C  -4.768951 1.330578 0.163259
C  -1.625239 2.313035 -1.12399
C  0.339647 0.8695 -0.449689
C  -0.196845 2.046823 -0.798325
C  1.788519 0.747617 -0.185824
C  -0.482018 -0.35009 -0.287716
C  2.469346 -0.424298 -0.545059
C  2.500083 1.772031 0.418319
C  3.825716 -0.557127 -0.318943
C  -1.403367 -0.744684 -1.25501
C  -0.35047 -1.126564 0.863996
C  4.539987 0.494867 0.289957
C  3.866189 1.648764 0.652103
C  -2.196378 -1.867267 -1.070687
C  -1.138076 -2.247014 1.064937
C  -2.060852 -2.605089 0.093513
C  3.885278 -2.757677 -1.200755
C  6.612698 1.278405 1.128025
H  -2.491795 2.967276 1.810734
H  -1.236768 1.799854 1.435023
H  -4.123424 2.500627 -1.507562
H  -4.281154 3.422331 -0.014818
H  -2.874838 -0.028548 1.346206
H  -3.034702 0.847127 2.876109
H  -5.832113 1.533536 0.029641
H  -4.534652 0.394607 -0.362412
H  0.453882 2.896172 -0.978346
H  1.91957 -1.226918 -1.01834
H  1.995094 2.673757 0.738673
H  -1.49986 -0.186014 -2.176836
H  0.363987 -0.845498 1.627032
H  4.386077 2.464723 1.135103
H  -2.90407 -2.161946 -1.833543
H  -1.034422 -2.829559 1.970125
H  4.636381 -3.530645 -1.345522
H  3.438249 -2.517893 -2.168763
H  3.107846 -3.14396 -0.536668
H  7.629239 0.899692 1.202242
H  6.240403 1.483517 2.134796
H  6.625532 2.209779 0.556744
elementType: Cl O N C H
totalener: -1629.42770302 hartree
nucrepener: 2636.89377035 hartree
electener: -4266.32147337 hartree
oneelecener: -7470.37408840 hartree
twoeener: 3204.05261503 hartree
cpcmener: -0.04854853 hartree
kineticenergy: 1623.68922340 hartree
xcener: -133.897807412538 hartree
chargesum: 0.0000000
charge: -0.096351 -0.400840 -0.573738 -0.344177 -0.340817 -0.079244 -0.102717 -0.068476 0.067466 0.012343 0.279454 0.102635 -0.108119 -0.023763 0.108675 -0.226794 -0.238685 0.229675 -0.200710 -0.233308 0.243160 -0.211132 -0.187233 -0.162218 0.148393 -0.128534 -0.128145 0.115500 0.120430 0.096816 0.110712 0.048804 0.114341 0.108422 0.084145 0.132727 0.147589 0.151423 0.148049 0.152128 0.141248 0.145035 0.142409 0.124736 0.114629 0.111862 0.124486 0.113839 0.113870
qa: -0.0964 -0.4008 -0.5737 -0.3442 -0.3408 -0.0792 -0.1027 -0.0685 0.0675 0.0123 0.2795 0.1026 -0.1081 -0.0238 0.1087 -0.2268 -0.2387 0.2297 -0.2007 -0.2333 0.2432 -0.2111 -0.1872 -0.1622 0.1484 -0.1285 -0.1281 0.1155 0.1204 0.0968 0.1107 0.0488 0.1143 0.1084 0.0841 0.1327 0.1476 0.1514 0.1480 0.1521 0.1412 0.1450 0.1424 0.1247 0.1146 0.1119 0.1245 0.1138 0.1139
va: 1.2096 1.9233 1.9100 2.0455 2.0418 3.1295 3.8825 3.8317 3.9124 3.9574 4.1756 3.3865 3.7949 3.5627 3.3251 3.8736 4.0134 3.9150 3.9436 3.9481 3.8998 3.8989 3.9923 3.9964 3.7569 3.8718 3.8702 1.0093 1.0021 1.0427 1.0053 1.0400 0.9992 0.9993 1.0009 1.0122 1.0031 1.0014 1.0239 0.9979 1.0115 1.0072 1.0076 0.9933 0.9860 0.9878 0.9935 0.9868 0.9862
dispcorr: -0.028040096 hartree
energy: -1629.455743116897
dipole: 10.59604 -9.64335 0.95269 14.37121 -14.29319 0.07803 4.08264 -2.25267 1.82997
magnitude: 2.06458 au
magnitude: 5.24774 debye
