program: Orca
programVersion: 5.0.2
elementType: S F O O O N N N C C C C C C C C C C C C C C C C C C H H H H H H H H H H H H H H H H H H H H H H H H
charge: 0
multiplicity: 1
keywords: wb97x-d3
keywords: def2-TZVPP
keywords: def2/J RIJCOSX
keywords: DEFGRID2
keywords: scfconv7
keywords: smallprint printgap noloewdin
keywords: NOSOSCF
formula: C18H24FN3O3S
InChI: InChI=1/C18H24FN3O3S/c1-9(2)15(22-18(24)25-10(3)4)16(23)20-11(5)17-21-13-7-6-12(19)8-14(13)26-17/h6-11,15,20,22H,1-5H3
50 atoms
S  0.884566 -0.156482 0.429279
F  5.731767 1.352138 -0.387226
O  -1.873103 -1.721494 -1.770519
O  -1.254906 2.599172 0.474818
O  -1.376753 1.623548 -1.560764
N  -2.742258 0.995964 0.133931
N  -1.609668 -1.612797 0.468744
N  1.893909 -2.505286 0.084432
C  -4.521756 -0.692978 0.137725
C  -3.262879 -0.160397 -0.561797
C  -2.183991 -1.239651 -0.690317
C  -0.533499 -2.572695 0.556664
C  -5.013682 -1.967186 -0.538929
C  -5.622276 0.361039 0.142116
C  0.789886 -1.897823 0.319662
C  -0.551351 -3.254477 1.919309
C  -1.752991 1.736086 -0.407669
C  2.578422 -0.264606 0.118824
C  2.935506 -1.613409 -0.035225
C  -0.189519 3.482964 0.059928
C  3.503776 0.766457 0.006604
C  4.265089 -1.941227 -0.295378
C  0.592599 3.818823 1.310902
C  -0.767734 4.710149 -0.613354
C  4.801563 0.39336 -0.259152
C  5.200638 -0.932457 -0.405441
H  -3.538245 0.124949 -1.579976
H  -4.266423 -0.929348 1.177365
H  -0.664932 -3.328829 -0.219492
H  -4.29623 -2.785908 -0.476733
H  -5.234267 -1.792859 -1.593926
H  -5.930848 -2.31164 -0.061627
H  -5.33289 1.268028 0.672169
H  -6.513853 -0.029601 0.633567
H  -5.899706 0.639469 -0.876575
H  -2.933766 1.086906 1.122215
H  -1.9304 -1.196434 1.332588
H  0.253216 -3.983625 1.985904
H  -1.495785 -3.777585 2.064122
H  -0.425355 -2.530979 2.725821
H  0.462654 2.951176 -0.636815
H  3.226961 1.807562 0.115773
H  4.558487 -2.975951 -0.4102
H  0.990925 2.922636 1.788301
H  1.436188 4.45747 1.050677
H  -0.020621 4.353761 2.037783
H  -1.329659 4.456482 -1.512171
H  0.039965 5.379914 -0.90914
H  -1.425479 5.25667 0.064236
H  6.238321 -1.162261 -0.607239
elementType: S F O N C H
totalener: -1588.57204679 hartree
nucrepener: 2669.64250752 hartree
electener: -4258.21455432 hartree
oneelecener: -7483.33256593 hartree
twoeener: 3225.11801161 hartree
cpcmener: -0.06443300 hartree
kineticenergy: 1582.80929351 hartree
xcener: -132.199572490016 hartree
chargesum: 0.0000000
charge: 0.001836 -0.221536 -0.522816 -0.332546 -0.540413 -0.236013 -0.210916 -0.319473 0.056380 0.110707 0.264908 0.058767 -0.304613 -0.295397 0.214595 -0.259262 0.472663 0.016171 0.172551 0.157000 -0.204102 -0.285828 -0.257386 -0.263810 0.281269 -0.151123 0.103790 0.058240 0.095430 0.094086 0.095912 0.096616 0.094697 0.096101 0.089588 0.182969 0.192171 0.096965 0.109957 0.102136 0.063443 0.151401 0.148263 0.089917 0.096178 0.102323 0.094554 0.099695 0.090931 0.153024
qa: 0.0018 -0.2215 -0.5228 -0.3325 -0.5404 -0.2360 -0.2109 -0.3195 0.0564 0.1107 0.2649 0.0588 -0.3046 -0.2954 0.2146 -0.2593 0.4727 0.0162 0.1726 0.1570 -0.2041 -0.2858 -0.2574 -0.2638 0.2813 -0.1511 0.1038 0.0582 0.0954 0.0941 0.0959 0.0966 0.0947 0.0961 0.0896 0.1830 0.1922 0.0970 0.1100 0.1021 0.0634 0.1514 0.1483 0.0899 0.0962 0.1023 0.0946 0.0997 0.0909 0.1530
va: 2.7413 1.0555 1.9764 2.0662 1.9426 3.1717 3.1439 3.1158 3.8411 3.7620 4.1286 3.8825 3.9500 3.9449 3.8852 3.9296 4.3547 3.8070 3.8108 3.7837 3.8711 4.0397 3.9206 3.9363 3.9583 3.8629 1.0384 1.0221 1.0370 1.0090 1.0035 1.0033 1.0106 1.0045 1.0016 1.0162 1.0015 1.0143 1.0067 1.0035 1.0260 1.0007 1.0122 1.0081 1.0047 1.0077 1.0159 1.0050 1.0070 0.9960
dispcorr: -0.027512902 hartree
energy: -1588.599559697259
dipole: -37.32510 35.85940 -1.46570 5.63391 -5.06874 0.56517 8.41761 -4.60744 3.81018
magnitude: 4.12130 au
magnitude: 10.47552 debye
