program: Orca
programVersion: 5.0.2
elementType: S F O O O N N N C C C C C C C C C C C C C C C C C C H H H H H H H H H H H H H H H H H H H H H H H H
charge: 0
multiplicity: 1
keywords: wb97x-d3
keywords: def2-TZVPP
keywords: def2/J RIJCOSX
keywords: DEFGRID2
keywords: scfconv7
keywords: smallprint printgap noloewdin
keywords: NOSOSCF
formula: C18H24FN3O3S
InChI: InChI=1/C18H24FN3O3S/c1-9(2)15(22-18(24)25-10(3)4)16(23)20-11(5)17-21-13-7-6-12(19)8-14(13)26-17/h6-11,15,20,22H,1-5H3
50 atoms
S  1.42376 -0.484772 -0.427927
F  6.395214 -0.004259 -1.656543
O  -1.692318 -2.262425 -1.207841
O  -2.560617 2.899169 1.102809
O  -1.611011 2.522349 -0.910957
N  -2.730209 0.88888 0.213703
N  -1.114098 -1.207646 0.703392
N  2.288143 -2.493248 0.942914
C  -4.066286 -0.558244 -1.281421
C  -2.66771 -0.110085 -0.823406
C  -1.786578 -1.301292 -0.453509
C  -0.156035 -2.186099 1.161356
C  -4.839322 0.624423 -1.849988
C  -4.855484 -1.250954 -0.176074
C  1.219485 -1.850154 0.646345
C  -0.168815 -2.272449 2.680953
C  -2.253377 2.143058 0.050978
C  3.115404 -0.826836 -0.480038
C  3.387864 -1.9431 0.325926
C  -2.202695 4.299715 1.089267
C  4.115684 -0.150096 -1.168475
C  4.701783 -2.391813 0.451253
C  -2.101467 4.724043 2.53776
C  -3.246112 5.088501 0.324966
C  5.396156 -0.629977 -1.014553
C  5.709383 -1.730121 -0.220786
H  -2.168982 0.342956 -1.684515
H  -3.909446 -1.275547 -2.089841
H  -0.431815 -3.15904 0.748941
H  -4.286882 1.115864 -2.652719
H  -5.055926 1.373496 -1.085939
H  -5.793952 0.293024 -2.260162
H  -4.318258 -2.099997 0.250422
H  -5.79828 -1.631079 -0.57084
H  -5.106366 -0.569027 0.639472
H  -3.348492 0.723877 0.996503
H  -1.229608 -0.371958 1.260281
H  0.546571 -3.015697 3.025374
H  -1.157346 -2.568164 3.029358
H  0.088717 -1.313657 3.132219
H  -1.226369 4.413179 0.613775
H  3.911576 0.709561 -1.792966
H  4.927444 -3.247998 1.072567
H  -1.806846 5.77194 2.587861
H  -3.056492 4.620338 3.05515
H  -1.35019 4.143218 3.073405
H  -4.230565 4.98527 0.784185
H  -3.315438 4.774687 -0.71671
H  -2.982967 6.146478 0.332094
H  6.736783 -2.05801 -0.135678
elementType: S F O N C H
totalener: -1588.57321825 hartree
nucrepener: 2559.50250368 hartree
electener: -4148.07572193 hartree
oneelecener: -7262.63647384 hartree
twoeener: 3114.56075191 hartree
cpcmener: -0.05066141 hartree
kineticenergy: 1582.79595661 hartree
xcener: -132.199822717453 hartree
chargesum: -0.0000000
charge: 0.035678 -0.222030 -0.548791 -0.337649 -0.553097 -0.274055 -0.217618 -0.331011 0.069429 0.111213 0.271184 0.109673 -0.319363 -0.295128 0.195668 -0.265507 0.546138 -0.024115 0.163564 0.157792 -0.195239 -0.284321 -0.253944 -0.260826 0.280702 -0.146809 0.114865 0.042611 0.097778 0.099452 0.084961 0.104304 0.095105 0.099047 0.084596 0.186854 0.198140 0.094412 0.106238 0.102527 0.066472 0.148724 0.148096 0.092197 0.089563 0.097203 0.089630 0.093110 0.098963 0.153613
qa: 0.0357 -0.2220 -0.5488 -0.3376 -0.5531 -0.2741 -0.2176 -0.3310 0.0694 0.1112 0.2712 0.1097 -0.3194 -0.2951 0.1957 -0.2655 0.5461 -0.0241 0.1636 0.1578 -0.1952 -0.2843 -0.2539 -0.2608 0.2807 -0.1468 0.1149 0.0426 0.0978 0.0995 0.0850 0.1043 0.0951 0.0990 0.0846 0.1869 0.1981 0.0944 0.1062 0.1025 0.0665 0.1487 0.1481 0.0922 0.0896 0.0972 0.0896 0.0931 0.0990 0.1536
va: 2.7327 1.0540 1.9615 2.0823 1.9451 3.1678 3.1560 3.1059 3.8320 3.8138 4.2410 3.8182 3.9457 3.9365 3.8771 3.9399 4.2767 3.8644 3.8469 3.8282 3.8665 4.0338 3.9354 3.9030 3.9297 3.8687 1.0405 1.0396 1.0347 1.0030 1.0077 1.0037 1.0098 1.0034 1.0044 1.0157 1.0114 1.0180 1.0085 1.0017 1.0228 1.0047 1.0125 1.0051 1.0062 1.0078 1.0074 1.0170 1.0063 0.9960
dispcorr: -0.024839346 hartree
energy: -1588.598057592705
dipole: -47.59303 45.89535 -1.69767 16.47148 -15.12204 1.34945 12.55356 -9.87979 2.67377
magnitude: 3.44270 au
magnitude: 8.75064 debye
