program: Orca
programVersion: 5.0.2
elementType: S F O O O N N N C C C C C C C C C C C C C C C C C C H H H H H H H H H H H H H H H H H H H H H H H H
charge: 0
multiplicity: 1
keywords: wb97x-d3
keywords: def2-TZVPP
keywords: def2/J RIJCOSX
keywords: DEFGRID2
keywords: scfconv7
keywords: smallprint printgap noloewdin
keywords: NOSOSCF
formula: C18H24FN3O3S
InChI: InChI=1/C18H24FN3O3S/c1-9(2)15(22-18(24)25-10(3)4)16(23)20-11(5)17-21-13-7-6-12(19)8-14(13)26-17/h6-11,15,20,22H,1-5H3
50 atoms
S  1.565472 -1.008799 -1.343803
F  6.487781 0.251452 -0.515855
O  -0.788016 -0.752185 1.169108
O  -2.332573 3.363661 0.694257
O  -2.914421 2.504732 -1.309863
N  -2.552106 1.180646 0.50485
N  -1.227637 -1.951227 -0.686069
N  2.060779 -2.789589 0.457945
C  -3.992692 -0.8221 0.174754
C  -2.678568 -0.084629 -0.166671
C  -1.472281 -0.950206 0.17798
C  -0.23009 -2.975115 -0.444294
C  -5.193868 -0.000095 -0.27293
C  -4.097997 -1.18302 1.651419
C  1.132357 -2.355862 -0.307948
C  -0.571066 -3.908029 0.709686
C  -2.61773 2.362242 -0.138523
C  3.156028 -1.050441 -0.667241
C  3.224935 -2.07504 0.289146
C  -2.271663 4.70729 0.173137
C  4.247946 -0.241138 -0.957106
C  4.416588 -2.295053 0.976335
C  -0.941625 4.940962 -0.51583
C  -2.475143 5.626994 1.35793
C  5.40627 -0.499614 -0.258608
C  5.513325 -1.503652 0.699114
H  -2.673418 0.101365 -1.243035
H  -3.989024 -1.750986 -0.405136
H  -0.203917 -3.571472 -1.361027
H  -6.11675 -0.55938 -0.111484
H  -5.142575 0.249071 -1.334155
H  -5.276668 0.931966 0.288868
H  -3.303273 -1.855933 1.978895
H  -5.043925 -1.690827 1.847461
H  -4.071646 -0.295846 2.288048
H  -2.212825 1.173032 1.456247
H  -1.846381 -2.07884 -1.47246
H  -0.560996 -3.399117 1.671644
H  0.139733 -4.732064 0.754211
H  -1.562069 -4.332339 0.549365
H  -3.08875 4.852585 -0.537552
H  4.206443 0.552256 -1.692182
H  4.47772 -3.082135 1.716286
H  -0.798028 4.277836 -1.368816
H  -0.894136 5.96544 -0.887331
H  -0.109275 4.79821 0.176061
H  -3.43174 5.443347 1.848905
H  -2.472326 6.66368 1.019958
H  -1.679452 5.515837 2.097132
H  6.450389 -1.658709 1.217413
elementType: S F O N C H
totalener: -1588.57814306 hartree
nucrepener: 2552.18643130 hartree
electener: -4140.76457436 hartree
oneelecener: -7249.04067955 hartree
twoeener: 3108.27610519 hartree
cpcmener: -0.04197236 hartree
kineticenergy: 1582.79987204 hartree
xcener: -132.197106481888 hartree
chargesum: 0.0000000
charge: 0.038617 -0.220375 -0.490945 -0.339116 -0.538889 -0.251959 -0.205162 -0.302595 0.079721 0.133739 0.226477 0.179781 -0.316342 -0.308873 0.116020 -0.294949 0.509648 -0.050599 0.182776 0.159204 -0.195950 -0.276319 -0.262421 -0.253704 0.279542 -0.146377 0.113488 0.049104 0.116414 0.101656 0.098137 0.087568 0.093343 0.097542 0.087705 0.170526 0.179286 0.098445 0.099878 0.101313 0.062961 0.144507 0.145742 0.093073 0.095606 0.088503 0.095697 0.089582 0.088702 0.150270
qa: 0.0386 -0.2204 -0.4909 -0.3391 -0.5389 -0.2520 -0.2052 -0.3026 0.0797 0.1337 0.2265 0.1798 -0.3163 -0.3089 0.1160 -0.2949 0.5096 -0.0506 0.1828 0.1592 -0.1959 -0.2763 -0.2624 -0.2537 0.2795 -0.1464 0.1135 0.0491 0.1164 0.1017 0.0981 0.0876 0.0933 0.0975 0.0877 0.1705 0.1793 0.0984 0.0999 0.1013 0.0630 0.1445 0.1457 0.0931 0.0956 0.0885 0.0957 0.0896 0.0887 0.1503
va: 2.6863 1.0564 2.0007 2.0871 1.9635 3.2065 3.1801 3.1140 3.7707 3.7883 4.3011 3.7500 3.9409 3.9474 3.9688 3.9460 4.3242 3.8650 3.8292 3.8376 3.8671 4.0288 3.8980 3.9378 3.9378 3.8686 1.0432 1.0279 0.9967 1.0051 1.0060 1.0053 1.0080 1.0038 1.0073 1.0396 1.0037 1.0147 1.0152 1.0075 1.0227 1.0053 1.0131 1.0196 1.0066 1.0078 1.0083 1.0055 1.0063 0.9973
dispcorr: -0.024887288 hartree
energy: -1588.603030349035
dipole: -44.06567 42.79777 -1.26790 11.31884 -12.39310 -1.07425 8.60025 -9.27883 -0.67858
magnitude: 1.79501 au
magnitude: 4.56255 debye
