program: Orca
programVersion: 5.0.2
elementType: S F O O O N N N C C C C C C C C C C C C C C C C C C H H H H H H H H H H H H H H H H H H H H H H H H
charge: 0
multiplicity: 1
keywords: wb97x-d3
keywords: def2-TZVPP
keywords: def2/J RIJCOSX
keywords: DEFGRID2
keywords: scfconv7
keywords: smallprint printgap noloewdin
keywords: NOSOSCF
formula: C18H24FN3O3S
InChI: InChI=1/C18H24FN3O3S/c1-9(2)15(22-18(24)25-10(3)4)16(23)20-11(5)17-21-13-7-6-12(19)8-14(13)26-17/h6-11,15,20,22H,1-5H3
50 atoms
S  1.346163 -0.396174 -0.586778
F  6.397332 0.344107 -1.265347
O  -2.002971 -2.175229 -1.568541
O  -1.975317 2.804139 0.792589
O  -1.317631 1.978988 -1.204468
N  -2.858482 0.91352 0.076479
N  -1.252112 -1.264239 0.36221
N  2.165558 -2.424345 0.784339
C  -4.502862 -0.747952 -0.708671
C  -3.078953 -0.1745 -0.840942
C  -2.052322 -1.299589 -0.718326
C  -0.295604 -2.293378 0.691917
C  -5.54554 0.326829 -0.991302
C  -4.75722 -1.430084 0.631715
C  1.102923 -1.825662 0.39226
C  -0.436433 -2.730949 2.143159
C  -1.992659 1.91491 -0.197209
C  3.051354 -0.652963 -0.463563
C  3.294195 -1.792829 0.319467
C  -1.14493 3.97743 0.666072
C  4.086817 0.095665 -1.012776
C  4.606929 -2.193467 0.563272
C  -0.807257 4.410057 2.076556
C  -1.883299 5.04835 -0.110783
C  5.365534 -0.341273 -0.749856
C  5.646359 -1.463967 0.024101
H  -2.977029 0.20507 -1.861197
H  -4.585736 -1.506522 -1.490852
H  -0.493451 -3.149336 0.041862
H  -6.540789 -0.116996 -1.045001
H  -5.357364 0.828503 -1.942494
H  -5.573418 1.090508 -0.211536
H  -5.773263 -1.827039 0.660666
H  -4.663865 -0.745072 1.478317
H  -4.08304 -2.270276 0.806394
H  -3.413558 0.975724 0.917571
H  -1.395404 -0.526982 1.038262
H  0.276699 -3.519254 2.375985
H  -1.439621 -3.118571 2.318605
H  -0.259614 -1.899401 2.826726
H  -0.224183 3.708265 0.143412
H  3.910726 0.974104 -1.620224
H  4.803214 -3.070001 1.166496
H  -0.277395 3.625833 2.6189
H  -0.157578 5.284854 2.044765
H  -1.701417 4.678975 2.64198
H  -2.122632 4.725168 -1.124424
H  -1.261306 5.940697 -0.190509
H  -2.811052 5.33062 0.390291
H  6.674147 -1.755919 0.195455
elementType: S F O N C H
totalener: -1588.58029816 hartree
nucrepener: 2587.66096139 hartree
electener: -4176.24125955 hartree
oneelecener: -7319.04847620 hartree
twoeener: 3142.80721665 hartree
cpcmener: -0.04198051 hartree
kineticenergy: 1582.79598608 hartree
xcener: -132.196648066046 hartree
chargesum: -0.0000000
charge: 0.037481 -0.220549 -0.509232 -0.335078 -0.519794 -0.272631 -0.226305 -0.323638 0.062158 0.102950 0.268018 0.129269 -0.301471 -0.298422 0.181185 -0.272912 0.519792 -0.030028 0.166056 0.155794 -0.196875 -0.281491 -0.249522 -0.261104 0.279987 -0.145377 0.109297 0.051257 0.096242 0.099390 0.097583 0.082855 0.100555 0.084156 0.093263 0.182139 0.187398 0.095530 0.103272 0.098786 0.064206 0.146044 0.145660 0.094890 0.090869 0.088659 0.094784 0.096665 0.088261 0.149978
qa: 0.0375 -0.2205 -0.5092 -0.3351 -0.5198 -0.2726 -0.2263 -0.3236 0.0622 0.1029 0.2680 0.1293 -0.3015 -0.2984 0.1812 -0.2729 0.5198 -0.0300 0.1661 0.1558 -0.1969 -0.2815 -0.2495 -0.2611 0.2800 -0.1454 0.1093 0.0513 0.0962 0.0994 0.0976 0.0829 0.1006 0.0842 0.0933 0.1821 0.1874 0.0955 0.1033 0.0988 0.0642 0.1460 0.1457 0.0949 0.0909 0.0887 0.0948 0.0967 0.0883 0.1500
va: 2.7409 1.0560 2.0187 2.0815 1.9854 3.1533 3.1491 3.1034 3.7935 3.8055 4.2272 3.7801 3.9471 3.9459 3.9291 3.9517 4.2976 3.8739 3.8511 3.8372 3.8678 4.0324 3.9325 3.9079 3.9353 3.8695 1.0389 1.0360 1.0435 1.0040 1.0037 1.0065 1.0046 1.0034 1.0110 1.0202 1.0180 1.0198 1.0078 1.0021 1.0234 1.0056 1.0135 1.0086 1.0057 1.0065 1.0160 1.0064 1.0074 0.9974
dispcorr: -0.025377327 hartree
energy: -1588.605675490109
dipole: -44.24532 42.62724 -1.61807 12.91624 -11.64171 1.27453 13.98355 -11.31068 2.67288
magnitude: 3.37444 au
magnitude: 8.57716 debye
