program: Orca
programVersion: 5.0.2
elementType: S F O O O N N N C C C C C C C C C C C C C C C C C C H H H H H H H H H H H H H H H H H H H H H H H H
charge: 0
multiplicity: 1
keywords: wb97x-d3
keywords: def2-TZVPP
keywords: def2/J RIJCOSX
keywords: DEFGRID2
keywords: scfconv7
keywords: smallprint printgap noloewdin
keywords: NOSOSCF
formula: C18H24FN3O3S
InChI: InChI=1/C18H24FN3O3S/c1-9(2)15(22-18(24)25-10(3)4)16(23)20-11(5)17-21-13-7-6-12(19)8-14(13)26-17/h6-11,15,20,22H,1-5H3
50 atoms
S  2.44069 -2.859801 -0.390484
F  6.66343 0.077145 -0.51678
O  -2.815455 -2.441206 -1.202378
O  -1.702015 2.708039 0.873031
O  -1.821989 2.195268 -1.322578
N  -2.721624 0.850071 0.277954
N  -1.283231 -1.410069 0.097453
N  1.303128 -0.624749 0.19582
C  -4.741318 -0.42612 -0.335634
C  -3.251075 -0.160562 -0.600198
C  -2.432692 -1.455674 -0.585715
C  -0.314848 -2.476422 0.106663
C  -5.559612 0.829786 -0.606487
C  -5.002126 -0.964391 1.067036
C  1.054192 -1.865946 -0.002243
C  -0.431421 -3.345729 1.358573
C  -2.063104 1.946757 -0.159198
C  3.439499 -1.452109 -0.277708
C  2.64073 -0.345718 0.047873
C  -0.98573 3.933856 0.620357
C  4.81007 -1.341593 -0.474079
C  3.228812 0.910132 0.185175
C  -0.164969 4.205241 1.862523
C  -1.963719 5.049884 0.313979
C  5.345561 -0.081145 -0.330988
C  4.588993 1.041077 -0.005721
H  -3.158662 0.214255 -1.623527
H  -5.049118 -1.188898 -1.054294
H  -0.489051 -3.101968 -0.771794
H  -6.626212 0.619513 -0.514316
H  -5.386165 1.211629 -1.614526
H  -5.32329 1.630637 0.096939
H  -6.05678 -1.217282 1.184345
H  -4.767957 -0.230694 1.84234
H  -4.429553 -1.869434 1.279298
H  -2.913865 0.77961 1.266916
H  -1.031345 -0.555435 0.571083
H  -0.254546 -2.757735 2.259619
H  0.284145 -4.168312 1.340142
H  -1.430795 -3.776517 1.414369
H  -0.313897 3.786636 -0.22829
H  5.432858 -2.18913 -0.728877
H  2.620683 1.769594 0.434971
H  -0.796694 4.343744 2.741827
H  0.534755 3.392925 2.064637
H  0.418216 5.115729 1.724378
H  -1.420276 5.979209 0.139072
H  -2.647884 5.214448 1.148583
H  -2.552867 4.842531 -0.579754
H  5.071554 2.004668 0.091801
elementType: S F O N C H
totalener: -1588.57958488 hartree
nucrepener: 2563.91139120 hartree
electener: -4152.49097608 hartree
oneelecener: -7271.31038687 hartree
twoeener: 3118.81941078 hartree
cpcmener: -0.03803577 hartree
kineticenergy: 1582.80585174 hartree
xcener: -132.199077406716 hartree
chargesum: 0.0000000
charge: 0.053882 -0.218465 -0.532892 -0.335936 -0.521947 -0.273387 -0.171604 -0.336059 0.067503 0.096396 0.282842 0.074122 -0.313474 -0.296969 0.177830 -0.260934 0.520916 -0.040382 0.186394 0.157509 -0.200656 -0.262041 -0.254855 -0.261578 0.286088 -0.148472 0.110981 0.042095 0.090600 0.101448 0.098174 0.082560 0.098402 0.081052 0.096302 0.181355 0.176686 0.102639 0.092741 0.101739 0.063931 0.146792 0.153098 0.092783 0.092490 0.091032 0.096101 0.088256 0.095075 0.149839
qa: 0.0539 -0.2185 -0.5329 -0.3359 -0.5219 -0.2734 -0.1716 -0.3361 0.0675 0.0964 0.2828 0.0741 -0.3135 -0.2970 0.1778 -0.2609 0.5209 -0.0404 0.1864 0.1575 -0.2007 -0.2620 -0.2549 -0.2616 0.2861 -0.1485 0.1110 0.0421 0.0906 0.1014 0.0982 0.0826 0.0984 0.0811 0.0963 0.1814 0.1767 0.1026 0.0927 0.1017 0.0639 0.1468 0.1531 0.0928 0.0925 0.0910 0.0961 0.0883 0.0951 0.1498
va: 2.6699 1.0592 1.9888 2.0748 1.9876 3.1643 3.1958 3.0547 3.8294 3.8111 4.2725 3.8621 3.9438 3.9386 3.9763 3.9370 4.3098 3.8594 3.8234 3.8282 3.8869 3.9954 3.9334 3.9113 3.9305 3.8712 1.0389 1.0402 1.0442 1.0040 1.0030 1.0088 1.0039 1.0045 1.0086 1.0196 1.0467 1.0041 1.0113 1.0076 1.0242 1.0037 1.0033 1.0074 1.0089 1.0057 1.0064 1.0072 1.0166 0.9979
dispcorr: -0.025061215 hartree
energy: -1588.604646095162
dipole: -44.33689 44.67585 0.33896 18.62717 -17.98326 0.64392 12.29217 -9.95147 2.34070
magnitude: 2.45121 au
magnitude: 6.23047 debye
