program: Orca
programVersion: 5.0.2
elementType: S F O O O N N N C C C C C C C C C C C C C C C C C C H H H H H H H H H H H H H H H H H H H H H H H H
charge: 0
multiplicity: 1
keywords: wb97x-d3
keywords: def2-TZVPP
keywords: def2/J RIJCOSX
keywords: DEFGRID2
keywords: scfconv7
keywords: smallprint printgap noloewdin
keywords: NOSOSCF
formula: C18H24FN3O3S
InChI: InChI=1/C18H24FN3O3S/c1-9(2)15(22-18(24)25-10(3)4)16(23)20-11(5)17-21-13-7-6-12(19)8-14(13)26-17/h6-11,15,20,22H,1-5H3
50 atoms
S  3.189785 -0.065005 1.032115
F  5.827852 -4.428191 0.313738
O  -0.672067 -0.111857 1.36581
O  -4.237387 2.82258 0.809994
O  -3.127551 2.489995 -1.125247
N  -3.361969 0.833101 0.410991
N  -0.27565 0.9007 -0.600348
N  1.928254 -0.869399 -1.065187
C  -2.850756 -1.549485 0.046391
C  -2.464175 -0.097063 -0.241423
C  -1.048813 0.210837 0.247827
C  1.070317 1.291868 -0.258372
C  -1.892337 -2.497199 -0.667155
C  -4.286599 -1.828163 -0.379703
C  1.966338 0.081542 -0.20769
C  1.594568 2.292052 -1.280878
C  -3.534825 2.089749 -0.051867
C  3.691624 -1.555693 0.315164
C  2.887775 -1.817959 -0.80541
C  -4.47935 4.211055 0.49928
C  4.700513 -2.422096 0.71905
C  3.107882 -2.975121 -1.550984
C  -3.255938 5.044709 0.826696
C  -5.688665 4.617958 1.31285
C  4.873646 -3.555576 -0.042684
C  4.106493 -3.846085 -1.167257
H  -2.534604 0.063644 -1.319691
H  -2.768059 -1.720755 1.125012
H  1.062058 1.769092 0.725007
H  -1.938076 -2.36088 -1.750043
H  -2.15525 -3.534382 -0.455731
H  -0.85428 -2.363749 -0.358901
H  -4.425173 -1.646162 -1.447967
H  -5.008436 -1.214546 0.159243
H  -4.542444 -2.871409 -0.187982
H  -3.624669 0.6342 1.366299
H  -0.616814 1.112107 -1.526134
H  2.602636 2.611496 -1.020224
H  0.957809 3.176732 -1.304495
H  1.624085 1.853995 -2.279137
H  -4.714709 4.301378 -0.563489
H  5.321682 -2.229071 1.583866
H  2.497594 -3.183824 -2.419672
H  -2.384261 4.742622 0.246621
H  -3.454075 6.091886 0.595709
H  -3.004685 4.979193 1.88668
H  -6.559393 4.009064 1.067877
H  -5.941227 5.656201 1.097535
H  -5.49945 4.536768 2.384406
H  4.297335 -4.75052 -1.729932
elementType: S F O N C H
totalener: -1588.57905132 hartree
nucrepener: 2536.53108100 hartree
electener: -4125.11013231 hartree
oneelecener: -7217.79170992 hartree
twoeener: 3092.68157761 hartree
cpcmener: -0.03722040 hartree
kineticenergy: 1582.81035477 hartree
xcener: -132.194747805655 hartree
chargesum: 0.0000000
charge: 0.060477 -0.219703 -0.518061 -0.336040 -0.531570 -0.227871 -0.139072 -0.312641 0.072744 0.097791 0.226426 0.045951 -0.293854 -0.297518 0.176906 -0.258240 0.511566 -0.058290 0.186838 0.162118 -0.192081 -0.277775 -0.263230 -0.254192 0.281407 -0.140648 0.099463 0.046849 0.090362 0.089750 0.095151 0.088694 0.086409 0.091854 0.095202 0.169415 0.175584 0.098039 0.111872 0.100524 0.064853 0.146449 0.145019 0.092896 0.096125 0.088666 0.096324 0.090255 0.088602 0.150204
qa: 0.0605 -0.2197 -0.5181 -0.3360 -0.5316 -0.2279 -0.1391 -0.3126 0.0727 0.0978 0.2264 0.0460 -0.2939 -0.2975 0.1769 -0.2582 0.5116 -0.0583 0.1868 0.1621 -0.1921 -0.2778 -0.2632 -0.2542 0.2814 -0.1406 0.0995 0.0468 0.0904 0.0897 0.0952 0.0887 0.0864 0.0919 0.0952 0.1694 0.1756 0.0980 0.1119 0.1005 0.0649 0.1464 0.1450 0.0929 0.0961 0.0887 0.0963 0.0903 0.0886 0.1502
va: 2.6889 1.0575 2.0012 2.0897 1.9738 3.1614 3.2051 3.0619 3.8299 3.8348 4.2398 3.9608 3.9516 3.9462 3.7875 3.9272 4.3273 3.8821 3.8045 3.8287 3.8692 4.0319 3.9008 3.9376 3.9345 3.8614 1.0319 1.0392 1.0293 1.0032 1.0051 1.0137 1.0023 1.0124 1.0047 1.0266 1.0153 1.0091 1.0064 1.0088 1.0227 1.0034 1.0135 1.0192 1.0067 1.0072 1.0080 1.0056 1.0066 0.9974
dispcorr: -0.024964921 hartree
energy: -1588.604016238430
dipole: -44.73053 44.12066 -0.60987 22.56346 -21.49108 1.07238 -4.28769 3.87865 -0.40904
magnitude: 1.29971 au
magnitude: 3.30360 debye
