program: Orca
programVersion: 5.0.2
elementType: S F O O O N N N C C C C C C C C C C C C C C C C C C H H H H H H H H H H H H H H H H H H H H H H H H
charge: 0
multiplicity: 1
keywords: wb97x-d3
keywords: def2-TZVPP
keywords: def2/J RIJCOSX
keywords: DEFGRID2
keywords: scfconv7
keywords: smallprint printgap noloewdin
keywords: NOSOSCF
formula: C18H24FN3O3S
InChI: InChI=1/C18H24FN3O3S/c1-9(2)15(22-18(24)25-10(3)4)16(23)20-11(5)17-21-13-7-6-12(19)8-14(13)26-17/h6-11,15,20,22H,1-5H3
50 atoms
S  2.21891 -3.324303 -0.528651
F  7.167245 -2.289533 -1.484397
O  -1.121033 -0.288097 -1.433191
O  -5.119465 1.842852 0.162197
O  -3.697225 2.031842 1.903826
N  -2.967031 1.527196 -0.189837
N  -0.538897 -0.627748 0.720112
N  2.194057 -0.868137 0.252039
C  -0.778508 2.601843 -0.612465
C  -1.555204 1.492234 0.111746
C  -1.038159 0.11119 -0.280745
C  -0.008027 -1.952957 0.532931
C  0.706915 2.521363 -0.279427
C  -1.333087 3.971982 -0.245451
C  1.440941 -1.894956 0.122566
C  -0.171427 -2.766875 1.81235
C  -3.910172 1.824072 0.724411
C  3.69764 -2.434189 -0.627057
C  3.479671 -1.12895 -0.161527
C  -6.254621 2.206343 0.974289
C  4.939568 -2.857756 -1.083063
C  4.535444 -0.219505 -0.147958
C  -7.468982 1.614638 0.291903
C  -6.344188 3.713704 1.105515
C  5.951346 -1.924876 -1.051755
C  5.778036 -0.621739 -0.594138
H  -1.44494 1.641848 1.187223
H  -0.902396 2.452868 -1.690862
H  -0.575222 -2.438828 -0.263905
H  1.164346 1.585155 -0.601285
H  0.876805 2.62054 0.795428
H  1.250706 3.327773 -0.773242
H  -0.777421 4.756256 -0.762097
H  -1.247014 4.161304 0.827091
H  -2.381475 4.085911 -0.522962
H  -3.246556 1.401376 -1.152254
H  -0.438316 -0.206674 1.631489
H  0.187622 -3.786234 1.675857
H  -1.224146 -2.82025 2.087799
H  0.384385 -2.320766 2.637966
H  -6.144879 1.754759 1.962883
H  5.116177 -3.861896 -1.445941
H  4.377716 0.789539 0.209478
H  -7.385984 0.531385 0.195193
H  -8.358896 1.825068 0.885371
H  -7.622777 2.040228 -0.701445
H  -7.21439 3.978649 1.707379
H  -6.456225 4.189668 0.129584
H  -5.467968 4.13664 1.596937
H  6.614579 0.064665 -0.592725
elementType: S F O N C H
totalener: -1588.57900841 hartree
nucrepener: 2493.38816557 hartree
electener: -4081.96717398 hartree
oneelecener: -7131.06139625 hartree
twoeener: 3049.09422226 hartree
cpcmener: -0.03821281 hartree
kineticenergy: 1582.80991933 hartree
xcener: -132.196132666072 hartree
chargesum: -0.0000000
charge: 0.045039 -0.219308 -0.524150 -0.337009 -0.535481 -0.230272 -0.143121 -0.319121 0.082728 0.057123 0.285788 0.051343 -0.313858 -0.306349 0.177473 -0.254141 0.516436 -0.056211 0.201142 0.159475 -0.194531 -0.268181 -0.253545 -0.262784 0.280493 -0.144884 0.096312 0.049023 0.097274 0.092039 0.090871 0.094722 0.099065 0.088560 0.092021 0.170036 0.170922 0.091340 0.107890 0.105384 0.063457 0.145322 0.148718 0.096019 0.090155 0.088416 0.096366 0.087972 0.093190 0.150831
qa: 0.0450 -0.2193 -0.5241 -0.3370 -0.5355 -0.2303 -0.1431 -0.3191 0.0827 0.0571 0.2858 0.0513 -0.3139 -0.3063 0.1775 -0.2541 0.5164 -0.0562 0.2011 0.1595 -0.1945 -0.2682 -0.2535 -0.2628 0.2805 -0.1449 0.0963 0.0490 0.0973 0.0920 0.0909 0.0947 0.0991 0.0886 0.0920 0.1700 0.1709 0.0913 0.1079 0.1054 0.0635 0.1453 0.1487 0.0960 0.0902 0.0884 0.0964 0.0880 0.0932 0.1508
va: 2.6672 1.0581 1.9971 2.0831 1.9694 3.1704 3.2109 3.0755 3.7891 3.8665 4.2244 3.8820 3.9609 3.9391 3.8694 3.9422 4.3178 3.8784 3.7887 3.8359 3.8822 4.0108 3.9377 3.8977 3.9352 3.8679 1.0541 1.0354 1.0337 1.0131 1.0022 1.0069 1.0052 1.0027 1.0116 1.0322 1.0147 1.0099 1.0080 1.0025 1.0232 1.0038 1.0092 1.0080 1.0056 1.0065 1.0071 1.0076 1.0193 0.9974
dispcorr: -0.024769341 hartree
energy: -1588.603777755705
dipole: -45.73969 45.34648 -0.39321 30.95368 -31.21838 -0.26470 10.31492 -9.48500 0.82992
magnitude: 0.95575 au
magnitude: 2.42931 debye
