program: Orca
programVersion: 5.0.2
elementType: S F O O O N N N C C C C C C C C C C C C C C C C C C H H H H H H H H H H H H H H H H H H H H H H H H
charge: 0
multiplicity: 1
keywords: wb97x-d3
keywords: def2-TZVPP
keywords: def2/J RIJCOSX
keywords: DEFGRID2
keywords: scfconv7
keywords: smallprint printgap noloewdin
keywords: NOSOSCF
formula: C18H24FN3O3S
InChI: InChI=1/C18H24FN3O3S/c1-9(2)15(22-18(24)25-10(3)4)16(23)20-11(5)17-21-13-7-6-12(19)8-14(13)26-17/h6-11,15,20,22H,1-5H3
50 atoms
S  1.768084 -1.064595 -1.482174
F  5.421563 -4.681014 -1.276647
O  -0.693836 -0.496064 1.264632
O  -4.016727 2.824414 1.405927
O  -2.863051 2.778294 -0.532538
N  -3.315407 0.879872 0.626829
N  -0.278187 0.898317 -0.45062
N  2.914109 -0.247768 0.683171
C  -3.058289 -1.431619 -0.178097
C  -2.529875 0.003851 -0.217321
C  -1.080079 0.090773 0.26487
C  1.061068 1.221344 -0.012111
C  -2.226521 -2.320507 -1.096546
C  -4.527375 -1.486222 -0.579278
C  1.952982 0.020093 -0.118113
C  1.609715 2.369532 -0.849361
C  -3.35227 2.213662 0.426952
C  3.135109 -1.952943 -0.90722
C  3.609172 -1.362072 0.275045
C  -4.077064 4.266697 1.400304
C  3.727965 -3.082354 -1.457041
C  4.703343 -1.923069 0.930377
C  -2.792688 4.841967 1.964309
C  -5.289785 4.640007 2.224331
C  4.810722 -3.595524 -0.77888
C  5.306602 -3.044897 0.398682
H  -2.606781 0.363226 -1.246827
H  -2.961867 -1.806266 0.846521
H  1.052746 1.52087 1.03918
H  -2.596969 -3.346099 -1.07143
H  -1.173687 -2.356634 -0.811923
H  -2.280217 -1.9766 -2.132381
H  -5.168633 -0.925132 0.100531
H  -4.879973 -2.518677 -0.577069
H  -4.679366 -1.089157 -1.585755
H  -3.632329 0.516056 1.514443
H  -0.673059 1.436834 -1.208381
H  0.986982 3.256123 -0.7263
H  1.641184 2.113986 -1.909362
H  2.619839 2.619152 -0.529735
H  -4.22016 4.613392 0.374251
H  3.368839 -3.542599 -2.368536
H  5.074159 -1.478225 1.844364
H  -2.626343 4.504267 2.988988
H  -1.922481 4.570064 1.366419
H  -2.851515 5.930945 1.9768
H  -6.20396 4.218826 1.804213
H  -5.402058 5.724169 2.237995
H  -5.195145 4.301073 3.257619
H  6.15876 -3.499026 0.887009
elementType: S F O N C H
totalener: -1588.57935524 hartree
nucrepener: 2547.40015993 hartree
electener: -4135.97951517 hartree
oneelecener: -7239.15809368 hartree
twoeener: 3103.17857851 hartree
cpcmener: -0.03780443 hartree
kineticenergy: 1582.81485145 hartree
xcener: -132.195324121764 hartree
chargesum: 0.0000000
charge: 0.023376 -0.220245 -0.504838 -0.335973 -0.533395 -0.222714 -0.186902 -0.290036 0.071988 0.093650 0.219772 0.077617 -0.286805 -0.295824 0.162854 -0.264199 0.515133 -0.024180 0.186584 0.161244 -0.191775 -0.288189 -0.263016 -0.253827 0.276387 -0.140266 0.101304 0.047947 0.095990 0.096439 0.079562 0.090098 0.091877 0.095032 0.086839 0.169790 0.183902 0.110686 0.099243 0.103261 0.065913 0.145504 0.146520 0.089288 0.093089 0.096411 0.096280 0.090248 0.088717 0.149638
qa: 0.0234 -0.2202 -0.5048 -0.3360 -0.5334 -0.2227 -0.1869 -0.2900 0.0720 0.0936 0.2198 0.0776 -0.2868 -0.2958 0.1629 -0.2642 0.5151 -0.0242 0.1866 0.1612 -0.1918 -0.2882 -0.2630 -0.2538 0.2764 -0.1403 0.1013 0.0479 0.0960 0.0964 0.0796 0.0901 0.0919 0.0950 0.0868 0.1698 0.1839 0.1107 0.0992 0.1033 0.0659 0.1455 0.1465 0.0893 0.0931 0.0964 0.0963 0.0902 0.0887 0.1496
va: 2.6800 1.0565 2.0084 2.0904 1.9709 3.1626 3.1678 3.1328 3.8346 3.8457 4.2220 3.8751 3.9367 3.9482 3.8605 3.9307 4.3188 3.8413 3.8118 3.8283 3.8656 4.0430 3.9043 3.9364 3.9403 3.8635 1.0294 1.0389 1.0367 1.0066 1.0243 1.0035 1.0120 1.0047 1.0023 1.0262 1.0103 1.0062 1.0060 1.0101 1.0231 1.0045 1.0131 1.0074 1.0170 1.0065 1.0079 1.0056 1.0065 0.9974
dispcorr: -0.025130485 hartree
energy: -1588.604485721644
dipole: -41.13391 39.90213 -1.23178 26.33946 -25.13139 1.20807 6.90643 -7.55483 -0.64840
magnitude: 1.84313 au
magnitude: 4.68487 debye
