program: Gaussian 09
title: 000064615
version: EM64L-G09RevD.01
frameworkgroup: C1[X(C19H25BrN2O2)]
method: RPBEPBE
basis: SDD
operation: Freq
keyword: #p
keyword: freq=noraman
keyword: PBEPBE/SDD
title: #p freq=noraman PBEPBE/SDD
converged: NO YES NO NO
title: Mulliken charges:
elementType: Br O O N N C C C C C C C C C C C C C C C C C C C H H H H H H H H H H H H H H H H H H H H H H H H H
charge: 0.024345 -0.287983 -0.239774 -0.174479 0.002376 0.411481 -0.089677 -0.087865 -0.094642 -0.509153 -0.504624 -0.557732 -0.451392 -0.451759 -0.455368 -0.381667 -0.681675 -0.290264 0.211052 0.212504 -0.189337 -0.403895 -0.137994 -0.302526 0.196970 0.194974 0.196727 0.190803 0.214476 0.199900 0.199838 0.219461 0.205961 0.197604 0.190725 0.196734 0.195565 0.198359 0.192250 0.222123 0.214482 0.197994 0.252617 0.219475 0.234006 0.249250 0.296384 0.288137 0.265232
chargesum: 0.00000
title: Mulliken charges with hydrogens summed into heavy atoms:
elementType: Br O O N N C C C C C C C C C C C C C C C C C C C
charge: 0.024345 -0.287983 -0.239774 -0.174479 0.002376 0.411481 0.107293 0.107109 0.102085 -0.103873 -0.104887 -0.132309 -0.063062 -0.059460 -0.064760 0.054938 -0.011589 0.192992 0.211052 0.212504 0.107047 -0.115758 -0.137994 -0.037294
polarizability: 2.89750516e+02 5.88879462e+00 2.52216016e+02 -2.22083961e+00 9.96131930e+00 1.61315199e+02
1716.lowfreq: -33.5339 0.0004 0.0005 0.0007 2.1076 2.6305 6.3933 14.8598 20.6078
frequency: -30.9202 11.3657 19.4932 38.7673 50.1914 58.7509 106.2009 130.7994 146.5907 164.3837 169.8776 185.9169 205.6953 227.7356 248.8911 275.1576 287.7452 294.0635 320.7717 338.8157 347.3485 378.3241 394.1288 394.6672 413.4902 420.1480 434.4544 443.3778 452.0786 458.5550 461.8185 496.7941 588.4004 624.2880 634.1992 638.1951 690.9652 691.2907 710.6766 730.2033 767.6551 780.2161 805.9555 813.3966 815.6737 846.6023 867.2556 870.9309 878.6716 892.5105 902.5044 937.3796 944.3639 945.9143 951.2485 957.2250 966.5161 973.1991 982.2906 995.0103 1040.3038 1043.5778 1048.0506 1050.4317 1054.2543 1067.6323 1082.6406 1085.9423 1101.3123 1103.7127 1104.7538 1109.6256 1111.2105 1114.3115 1147.2398 1156.1094 1174.6074 1186.4187 1209.4059 1227.9442 1240.5190 1258.3793 1277.8927 1280.7601 1287.2593 1290.7154 1292.5016 1298.8916 1300.3073 1305.6638 1310.2727 1315.2447 1322.2679 1324.6844 1341.1547 1344.2544 1351.7732 1360.2564 1366.3901 1376.2888 1403.4363 1415.8322 1436.7295 1451.0460 1453.3723 1461.9185 1464.3060 1465.4735 1467.5826 1476.5636 1484.4738 1487.3912 1491.3288 1525.1186 1566.5389 1620.8987 2877.8451 2923.1274 2960.1922 2963.0172 2964.4571 2966.0486 2970.7331 2975.5534 2992.5180 2995.2949 3007.1212 3015.8366 3021.7907 3022.1563 3022.4637 3030.0450 3033.1403 3035.5903 3040.0735 3062.0776 3090.6121 3097.8785 3154.7839 3163.0210 3189.9981
redmass: 3.6342 6.0840 5.8996 5.7527 7.9293 4.8643 3.6542 3.8731 4.4041 3.7086 4.6108 1.7940 3.5008 1.8660 2.7675 13.1009 4.1306 1.9946 2.8395 2.6360 2.9577 3.7428 4.2002 4.2231 2.3053 2.0565 4.5919 1.8568 2.2237 4.8696 2.8906 4.6320 3.6283 9.1832 3.8240 3.8180 3.9867 4.0830 8.7082 3.3725 3.9155 1.1887 2.7495 2.6993 6.5786 4.2749 1.6191 1.5660 1.5638 8.7519 1.6092 2.0624 1.3691 2.0828 2.5879 1.5062 2.2152 2.1581 2.6359 5.7117 1.9517 1.7677 1.7927 1.7466 7.2963 2.9388 2.0273 3.1779 1.3070 1.3282 1.4247 1.2504 1.2491 1.0731 1.7014 2.1785 1.2663 1.2124 1.5032 2.4302 1.6739 1.6136 1.9635 1.8168 1.7349 1.8209 1.6395 1.4355 1.7194 5.4187 1.6213 1.4975 1.4523 1.3185 1.4267 1.4468 1.4730 1.5925 1.5396 1.4137 2.0193 2.7983 1.1460 1.0826 1.0836 1.0926 1.0880 1.0820 1.0883 1.0675 1.0803 1.0679 1.0614 7.0384 6.3077 11.9639 1.0562 1.0706 1.0606 1.0638 1.0612 1.0614 1.0604 1.0613 1.0827 1.0825 1.0825 1.1026 1.0990 1.0610 1.1025 1.1021 1.1021 1.0751 1.1018 1.0900 1.0989 1.1084 1.0918 1.0942 1.0936
irintensity: 0.0195 0.1716 0.1674 0.0544 0.5954 0.2453 0.1696 0.3808 1.2020 0.5438 0.0077 0.5117 3.8048 0.6201 3.2028 4.3892 3.5097 0.0204 9.8621 10.6504 2.1754 1.2556 0.8546 0.7616 4.3730 2.3082 1.3712 1.8106 3.6157 5.6547 3.3423 5.8411 6.4397 2.4330 0.1423 0.0329 5.0834 4.4227 39.5973 34.3373 0.9925 4.6232 3.3261 2.1381 5.6151 10.4669 0.4030 0.0163 0.0057 80.3167 18.2473 1.6086 3.1673 0.0298 27.0718 4.2528 6.0040 4.7076 2.5976 102.0207 11.0606 39.3174 0.6828 6.2722 255.1619 41.2886 35.0225 19.5260 6.2697 3.7716 0.6849 0.6443 5.7452 0.8472 4.8348 48.9935 3.6467 3.1871 33.9670 390.0011 40.9553 3.7619 2.0848 3.3612 3.7086 1.5587 3.3363 8.9185 19.5660 6.3737 2.6382 5.3999 8.8799 0.1113 1.6970 1.5817 11.4328 1.5730 6.8968 4.6897 32.7077 6.6621 8.4886 1.4867 0.6066 14.1877 17.3278 5.3937 14.8968 8.2051 4.5771 6.3499 11.5947 44.0768 27.5304 180.9104 90.5904 50.0574 27.7537 17.5633 29.5456 16.0111 10.5224 84.5856 153.9059 159.2374 38.8606 9.3861 13.7336 6.1737 22.7092 108.8467 39.2678 42.7529 55.7089 16.0153 34.8189 27.7652 6.4379 0.0263 1.4896
temp: 298.150 k
press: 1.00000 atm
elementType: 35 8 8 7 7 6 6 6 6 6 6 6 6 6 6 6 6 6 6 6 6 6 6 6 1 1 1 1 1 1 1 1 1 1 1 1 1 1 1 1 1 1 1 1 1 1 1 1 1
symmnumber: 1
zpe: 1072401.2 jmol-1
zpe.correction: 0.408456 hartree
zpe.thermalcorrener: 0.429545 hartree
zpe.thermalcorrenthalpy: 0.430489 hartree
zpe.thermalcorrgfe: 0.355896 hartree
zpe.sumelectzpe: -1010.610179 hartree
zpe.sumelectthermal: -1010.589090 hartree
zpe.sumelectthermalent: -1010.588146 hartree
zpe.sumelectthermalfe: -1010.662739 hartree
dipole: 3.9700 -2.3266 -1.1084
dipole: 4.7331
quadrupole: -157.5552 -163.7026 -151.6548
quadrupole: 7.6695 0.5229 -4.2234
quadrupole: 0.0823 -6.0651 5.9828 7.6695 0.5229 -4.2234
hfenergy: -1011.0186352 hartree
pointgroup: C01 [X(C19H25Br1N2O2)]
dipole: -1.6775748 -0.5077249 0.6289652 debye
polarizability: 287.2639762|-11.6687664|239.8519767|-0.1435083|-35.4418112|176.165778 unknown
InChI: InChI=1S/C19H25BrN2O2/c1-22(2-3-24-18(23)16-7-17(20)12-21-11-16)19-8-13-4-14(9-19)6-15(5-13)10-19/h7,11-15H,2-6,8-10H2,1H3
charge 0 multiplicity 1
49 atoms
Br 5.463418 -3.286814 1.409934
O  1.913668 0.570287 -0.142376
O  3.044065 2.281212 -1.258817
N  -1.724571 1.306389 0.383636
N  6.712569 0.203539 -0.611795
C  -2.935204 0.426664 0.197332
C  -4.021657 -1.286855 -1.37185
C  -4.412762 -1.450424 1.130355
C  -5.463458 0.426681 -0.208993
C  -2.778528 -0.390786 -1.121747
C  -3.160588 -0.564917 1.386288
C  -4.210618 1.308358 0.048925
C  -4.210351 -2.262212 -0.178125
C  -5.277968 -0.389251 -1.514127
C  -5.664435 -0.543466 0.986302
C  -0.425984 0.604376 0.532096
C  -1.852778 2.415767 1.354502
C  0.612827 1.277298 -0.374742
C  3.054916 1.184449 -0.649587
C  4.283881 0.376785 -0.378604
C  4.237649 -0.872336 0.29178
C  5.541327 0.872285 -0.810147
C  5.450218 -1.556197 0.49202
C  6.666851 -0.99943 0.032532
H  -3.867444 -1.864989 -2.304285
H  -4.551269 -2.145506 1.982412
H  -6.348562 1.086497 -0.303533
H  -1.877396 -1.033165 -1.079372
H  -2.633981 0.320604 -1.958308
H  -3.28923 0.004408 2.329235
H  -2.268553 -1.211282 1.512275
H  -4.059527 2.02616 -0.781622
H  -4.382378 1.894798 0.971678
H  -5.086507 -2.916466 -0.358861
H  -3.323625 -2.92113 -0.082585
H  -5.161931 0.294693 -2.378662
H  -6.174814 -1.012101 -1.704646
H  -6.567515 -1.164893 0.822659
H  -5.827614 0.031185 1.920525
H  -0.51779 -0.454154 0.238595
H  -0.055938 0.611528 1.582189
H  -2.076935 2.082899 2.397341
H  -2.634335 3.125728 1.040552
H  -0.902343 2.977749 1.38468
H  0.745325 2.349534 -0.147073
H  0.342617 1.174831 -1.439781
H  3.281078 -1.274191 0.633066
H  5.600595 1.833683 -1.329563
H  7.619985 -1.517824 0.178394
