program: Orca
programVersion: 5.0.2
elementType: S F O O O N N N C C C C C C C C C C C C C C C C C C H H H H H H H H H H H H H H H H H H H H H H H H
charge: 0
multiplicity: 1
keywords: wb97x-d3
keywords: def2-TZVPP
keywords: def2/J RIJCOSX
keywords: DEFGRID2
keywords: scfconv7
keywords: smallprint printgap noloewdin
keywords: NOSOSCF
formula: C18H24FN3O3S
InChI: InChI=1/C18H24FN3O3S/c1-9(2)15(22-18(24)25-10(3)4)16(23)20-11(5)17-21-13-7-6-12(19)8-14(13)26-17/h6-11,15,20,22H,1-5H3
50 atoms
S  2.474812 -2.809637 -0.546913
F  6.686121 0.12571 -0.184146
O  -2.962218 -2.460661 -1.083564
O  -1.623208 2.711592 0.778989
O  -2.099168 2.230461 -1.376957
N  -2.703879 0.845817 0.328738
N  -1.261775 -1.382049 -0.065247
N  1.294152 -0.621931 0.125096
C  -4.768251 -0.479664 0.007717
C  -3.339565 -0.173879 -0.466111
C  -2.509043 -1.459045 -0.566499
C  -0.309765 -2.451356 -0.209876
C  -5.658555 0.748312 -0.133659
C  -4.809323 -1.02706 1.431585
C  1.063674 -1.844739 -0.176809
C  -0.470513 -3.518888 0.874008
C  -2.140895 1.963757 -0.202819
C  3.458043 -1.413949 -0.272955
C  2.636178 -0.333604 0.079982
C  -0.955622 3.928871 0.415597
C  4.837697 -1.287876 -0.370522
C  3.210151 0.908016 0.341017
C  0.022963 4.223547 1.535115
C  -1.962631 5.045834 0.215336
C  5.363219 -0.043209 -0.102841
C  4.578462 1.051931 0.248861
H  -3.397957 0.213972 -1.487087
H  -5.143111 -1.258382 -0.659582
H  -0.459006 -2.926635 -1.185182
H  -6.689968 0.506932 0.125825
H  -5.655625 1.130731 -1.155268
H  -5.336962 1.558558 0.52284
H  -5.826848 -1.313778 1.697814
H  -4.496056 -0.2847 2.170753
H  -4.184591 -1.912898 1.55163
H  -2.736469 0.77084 1.332283
H  -0.907577 -0.497126 0.263409
H  -0.318466 -3.088331 1.863487
H  0.242703 -4.333044 0.74104
H  -1.472558 -3.940227 0.82176
H  -0.40659 3.766696 -0.515424
H  5.480183 -2.11306 -0.645141
H  2.578904 1.744196 0.609062
H  -0.490648 4.38294 2.484156
H  0.733963 3.407168 1.666412
H  0.588661 5.126524 1.306216
H  -1.445395 5.975102 -0.025773
H  -2.546539 5.21358 1.121652
H  -2.643493 4.824859 -0.605025
H  5.052434 2.004005 0.443668
totalener: -1588.55081675 hartree
nucrepener: 2565.06438655 hartree
electener: -4153.61520331 hartree
oneelecener: -7273.22176067 hartree
twoeener: 3119.60655736 hartree
kineticenergy: 1582.87767084 hartree
xcener: -132.204718791659 hartree
chargesum: -0.0000000
charge: 0.049560 -0.198174 -0.415561 -0.322539 -0.412386 -0.301165 -0.189342 -0.313885 0.048311 0.097489 0.232828 0.042346 -0.279462 -0.293561 0.198172 -0.262439 0.472001 -0.021528 0.167061 0.140655 -0.190747 -0.216714 -0.237840 -0.254528 0.270026 -0.134000 0.110435 0.057664 0.088282 0.091192 0.095404 0.072334 0.091697 0.061530 0.102938 0.157498 0.158679 0.089181 0.083998 0.107995 0.064799 0.122035 0.123749 0.087934 0.084192 0.081418 0.081790 0.080150 0.106255 0.124273
qa: 0.0496 -0.1982 -0.4156 -0.3225 -0.4124 -0.3012 -0.1893 -0.3139 0.0483 0.0975 0.2328 0.0423 -0.2795 -0.2936 0.1982 -0.2624 0.4720 -0.0215 0.1671 0.1407 -0.1907 -0.2167 -0.2378 -0.2545 0.2700 -0.1340 0.1104 0.0577 0.0883 0.0912 0.0954 0.0723 0.0917 0.0615 0.1029 0.1575 0.1587 0.0892 0.0840 0.1080 0.0648 0.1220 0.1237 0.0879 0.0842 0.0814 0.0818 0.0802 0.1063 0.1243
va: 2.6653 1.0893 2.1072 2.0703 2.1015 3.1318 3.1479 3.0705 3.8552 3.8297 4.3044 3.9345 3.9390 3.9446 3.8934 3.9078 4.3328 3.8702 3.8982 3.8687 3.9051 4.0140 3.9310 3.9087 4.0037 3.8931 1.0387 1.0377 1.0320 1.0064 1.0063 1.0118 1.0077 1.0074 1.0071 1.0398 1.0737 1.0094 1.0141 1.0146 1.0232 1.0116 1.0121 1.0102 1.0112 1.0080 1.0099 1.0087 1.0180 1.0062
dispcorr: -0.025216167 hartree
energy: -1588.576032920896
dipole: -43.48475 43.93661 0.45185 17.72526 -17.28104 0.44422 11.73335 -10.41209 1.32126
magnitude: 1.46534 au
magnitude: 3.72461 debye
