program: Orca
programVersion: 5.0.2
elementType: S F O O O N N N C C C C C C C C C C C C C C C C C C H H H H H H H H H H H H H H H H H H H H H H H H
charge: 0
multiplicity: 1
keywords: wb97x-d3
keywords: def2-TZVPP
keywords: def2/J RIJCOSX
keywords: DEFGRID2
keywords: scfconv7
keywords: smallprint printgap noloewdin
keywords: NOSOSCF
formula: C18H24FN3O3S
InChI: InChI=1/C18H24FN3O3S/c1-9(2)15(22-18(24)25-10(3)4)16(23)20-11(5)17-21-13-7-6-12(19)8-14(13)26-17/h6-11,15,20,22H,1-5H3
50 atoms
S  2.473208 -0.401331 -0.265725
F  7.56657 -1.110766 -0.526015
O  -1.569341 -0.467381 -1.33181
O  -5.259451 2.031213 -0.529397
O  -4.205988 2.408746 1.434779
N  -3.17082 1.357791 -0.287817
N  -0.365082 -0.723046 0.561937
N  2.484944 -2.924973 0.276961
C  -1.025201 2.393817 0.369984
C  -1.933071 1.141029 0.410227
C  -1.284152 -0.092131 -0.214616
C  0.202752 -2.006896 0.211475
C  -0.500848 2.688696 -1.029109
C  0.104776 2.345234 1.391057
C  1.701567 -1.925288 0.127916
C  -0.244561 -3.105562 1.167976
C  -4.217204 1.971314 0.307222
C  3.999619 -1.211448 -0.226608
C  3.795824 -2.565972 0.081198
C  -6.482426 2.597324 -0.037563
C  5.270702 -0.689976 -0.437434
C  4.891718 -3.421763 0.169751
C  -7.246909 1.574281 0.783562
C  -7.259124 3.053174 -1.25685
C  6.325123 -1.56986 -0.335548
C  6.159237 -2.920834 -0.040003
H  -2.161025 0.931698 1.46157
H  -1.687632 3.210375 0.669694
H  -0.16564 -2.236029 -0.79195
H  0.230175 1.946563 -1.356495
H  -0.007596 3.660854 -1.050829
H  -1.303848 2.714297 -1.765491
H  0.878735 1.623674 1.127577
H  -0.265487 2.108656 2.391392
H  0.592316 3.318151 1.455729
H  -3.270092 0.953334 -1.205931
H  -0.262224 -0.420152 1.517695
H  -1.330012 -3.192828 1.149656
H  0.071598 -2.895156 2.190473
H  0.186933 -4.061682 0.881599
H  -6.248619 3.461232 0.589836
H  5.440212 0.351926 -0.672043
H  4.736725 -4.466433 0.401384
H  -6.687619 1.273175 1.668027
H  -8.192973 1.999182 1.120886
H  -7.471584 0.685922 0.191058
H  -7.497439 2.21522 -1.913363
H  -6.700868 3.791151 -1.832377
H  -8.197966 3.512081 -0.9472
H  7.02787 -3.561717 0.02208
totalener: -1588.54952748 hartree
nucrepener: 2490.28583940 hartree
electener: -4078.83536688 hartree
oneelecener: -7123.73669269 hartree
twoeener: 3044.90132581 hartree
kineticenergy: 1582.86087042 hartree
xcener: -132.201146313862 hartree
chargesum: 0.0000000
charge: 0.015494 -0.199710 -0.407741 -0.319601 -0.444436 -0.249073 -0.249167 -0.270542 0.061143 0.063895 0.282875 0.083201 -0.275226 -0.323752 0.151502 -0.247726 0.456415 -0.013972 0.153961 0.145302 -0.183429 -0.240604 -0.257758 -0.230286 0.263268 -0.119820 0.100463 0.061565 0.105424 0.079381 0.090566 0.097398 0.073024 0.099380 0.095926 0.164232 0.153725 0.101107 0.079290 0.103135 0.061320 0.122011 0.129012 0.101931 0.080725 0.081205 0.082304 0.090894 0.076378 0.125391
qa: 0.0155 -0.1997 -0.4077 -0.3196 -0.4444 -0.2491 -0.2492 -0.2705 0.0611 0.0639 0.2829 0.0832 -0.2752 -0.3238 0.1515 -0.2477 0.4564 -0.0140 0.1540 0.1453 -0.1834 -0.2406 -0.2578 -0.2303 0.2633 -0.1198 0.1005 0.0616 0.1054 0.0794 0.0906 0.0974 0.0730 0.0994 0.0959 0.1642 0.1537 0.1011 0.0793 0.1031 0.0613 0.1220 0.1290 0.1019 0.0807 0.0812 0.0823 0.0909 0.0764 0.1254
va: 2.7171 1.0871 2.0912 2.0951 2.0628 3.1927 3.1690 3.1128 3.7312 3.9026 4.1891 3.8211 3.9427 3.9356 3.9297 3.9663 4.3573 3.8808 3.9363 3.8745 3.8769 4.0375 3.9010 3.9303 4.0140 3.8832 1.0373 1.0284 1.0423 1.0075 1.0019 1.0172 1.0219 1.0023 1.0130 1.0542 1.0212 1.0060 1.0075 1.0202 1.0234 1.0123 1.0178 1.0193 1.0097 1.0092 1.0092 1.0107 1.0082 1.0058
dispcorr: -0.024706743 hartree
energy: -1588.574234222918
dipole: -47.84518 47.78629 -0.05888 17.32631 -17.45240 -0.12609 5.18028 -4.76187 0.41841
magnitude: 0.44095 au
magnitude: 1.12079 debye
