program: Orca
programVersion: 5.0.2
elementType: S F O O O N N N C C C C C C C C C C C C C C C C C C H H H H H H H H H H H H H H H H H H H H H H H H
charge: 0
multiplicity: 1
keywords: wb97x-d3
keywords: def2-TZVPP
keywords: def2/J RIJCOSX
keywords: DEFGRID2
keywords: scfconv7
keywords: smallprint printgap noloewdin
keywords: NOSOSCF
formula: C18H24FN3O3S
InChI: InChI=1/C18H24FN3O3S/c1-9(2)15(22-18(24)25-10(3)4)16(23)20-11(5)17-21-13-7-6-12(19)8-14(13)26-17/h6-11,15,20,22H,1-5H3
50 atoms
S  2.513072 -0.40871 -0.294516
F  7.612228 -1.108433 -0.409608
O  -1.627253 -0.473383 -1.359557
O  -5.354546 1.845596 -0.330736
O  -4.235751 2.241895 1.593417
N  -3.230754 1.26484 -0.190154
N  -0.347762 -0.776418 0.475616
N  2.510335 -2.945862 0.184111
C  -1.087152 2.327914 0.436104
C  -1.965173 1.053459 0.458027
C  -1.309945 -0.136867 -0.23859
C  0.230563 -2.030301 0.042509
C  -0.629265 2.696845 -0.968557
C  0.086766 2.259312 1.40539
C  1.730284 -1.944519 0.029786
C  -0.260707 -3.206652 0.876279
C  -4.274867 1.824834 0.459014
C  4.038582 -1.218014 -0.219737
C  3.826985 -2.579867 0.047397
C  -6.553699 2.438953 0.185726
C  5.314906 -0.690677 -0.375714
C  4.920835 -3.4363 0.153314
C  -7.696955 1.843493 -0.612031
C  -6.492597 3.951158 0.066142
C  6.36676 -1.572382 -0.263282
C  6.193802 -2.929669 -0.003444
H  -2.149951 0.798473 1.507873
H  -1.753384 3.11495 0.799636
H  -0.094736 -2.168926 -0.991887
H  -0.149933 3.676378 -0.964571
H  -1.464917 2.745437 -1.66653
H  0.096591 1.982764 -1.363444
H  0.555811 3.239343 1.495018
H  0.863291 1.568032 1.076138
H  -0.233922 1.96808 2.408588
H  -3.35474 0.876753 -1.112443
H  -0.228909 -0.52511 1.444316
H  -1.345127 -3.278595 0.806769
H  0.015646 -3.093491 1.925149
H  0.173433 -4.13795 0.520459
H  -6.662602 2.164494 1.238178
H  5.490591 0.356693 -0.579258
H  4.760031 -4.486337 0.354733
H  -8.646979 2.228948 -0.242175
H  -7.620498 2.100331 -1.669482
H  -7.720308 0.757419 -0.524873
H  -6.357962 4.256159 -0.972892
H  -5.681126 4.366577 0.661459
H  -7.423773 4.390724 0.425549
H  7.060867 -3.571389 0.071629
totalener: -1588.54961419 hartree
nucrepener: 2486.88191204 hartree
electener: -4075.43152623 hartree
oneelecener: -7116.91476018 hartree
twoeener: 3041.48323396 hartree
kineticenergy: 1582.86637848 hartree
xcener: -132.201921407657 hartree
chargesum: -0.0000000
charge: 0.017211 -0.199526 -0.409561 -0.319381 -0.443549 -0.250918 -0.245331 -0.267125 0.060948 0.064068 0.283538 0.086448 -0.275121 -0.323229 0.135814 -0.246631 0.458497 -0.016437 0.157242 0.144588 -0.181564 -0.239866 -0.230915 -0.259190 0.263051 -0.119491 0.102200 0.061298 0.106305 0.090233 0.097091 0.079226 0.095940 0.073575 0.097950 0.164103 0.152319 0.101817 0.079988 0.101602 0.062123 0.121926 0.129161 0.076652 0.082059 0.090960 0.081204 0.102831 0.080338 0.125528
qa: 0.0172 -0.1995 -0.4096 -0.3194 -0.4435 -0.2509 -0.2453 -0.2671 0.0609 0.0641 0.2835 0.0864 -0.2751 -0.3232 0.1358 -0.2466 0.4585 -0.0164 0.1572 0.1446 -0.1816 -0.2399 -0.2309 -0.2592 0.2631 -0.1195 0.1022 0.0613 0.1063 0.0902 0.0971 0.0792 0.0959 0.0736 0.0980 0.1641 0.1523 0.1018 0.0800 0.1016 0.0621 0.1219 0.1292 0.0767 0.0821 0.0910 0.0812 0.1028 0.0803 0.1255
va: 2.7102 1.0873 2.0887 2.0946 2.0644 3.1911 3.1784 3.1147 3.7337 3.9092 4.1904 3.8072 3.9415 3.9373 3.9449 3.9682 4.3543 3.8759 3.9288 3.8768 3.8755 4.0363 3.9321 3.9014 4.0146 3.8826 1.0355 1.0285 1.0422 1.0018 1.0177 1.0076 1.0133 1.0216 1.0027 1.0549 1.0225 1.0058 1.0082 1.0199 1.0229 1.0122 1.0177 1.0081 1.0090 1.0108 1.0090 1.0192 1.0098 1.0058
dispcorr: -0.024687899 hartree
energy: -1588.574302084362
dipole: -47.59278 47.57668 -0.01610 19.63757 -19.75537 -0.11780 4.16910 -3.81178 0.35732
magnitude: 0.37658 au
magnitude: 0.95719 debye
