program: Orca
programVersion: 5.0.2
elementType: S F O O O N N N C C C C C C C C C C C C C C C C C C H H H H H H H H H H H H H H H H H H H H H H H H
charge: 0
multiplicity: 1
keywords: wb97x-d3
keywords: def2-TZVPP
keywords: def2/J RIJCOSX
keywords: DEFGRID2
keywords: scfconv7
keywords: smallprint printgap noloewdin
keywords: NOSOSCF
formula: C18H24FN3O3S
InChI: InChI=1/C18H24FN3O3S/c1-9(2)15(22-18(24)25-10(3)4)16(23)20-11(5)17-21-13-7-6-12(19)8-14(13)26-17/h6-11,15,20,22H,1-5H3
50 atoms
S  1.049615 -1.034653 -1.202945
F  5.326867 1.823055 -1.05099
O  -1.829871 -1.982339 -1.786819
O  -1.235302 2.67833 -0.14855
O  -2.059863 1.181767 1.31978
N  -2.51519 1.053797 -0.91083
N  -1.72133 -1.582088 0.434727
N  1.515024 -1.269378 1.3270
C  -4.426877 -0.31416 0.004867
C  -3.219191 -0.219595 -0.937806
C  -2.201512 -1.360461 -0.811259
C  -0.562081 -2.424547 0.658765
C  -5.129598 -1.65199 -0.208546
C  -5.388848 0.842843 -0.236057
C  0.688766 -1.619788 0.413617
C  -0.592357 -3.006992 2.0613
C  -1.938812 1.599456 0.186472
C  2.441287 -0.240967 -0.559768
C  2.523154 -0.487845 0.818954
C  -0.511997 3.371394 0.886045
C  3.381395 0.542106 -1.220146
C  3.565871 0.068287 1.556731
C  -0.260615 4.767051 0.351896
C  0.773482 2.638305 1.223002
C  4.397641 1.067976 -0.454709
C  4.504928 0.84997 0.916946
H  -3.60646 -0.306806 -1.955612
H  -4.094735 -0.264487 1.043135
H  -0.604974 -3.235302 -0.071073
H  -5.480948 -1.75831 -1.237323
H  -5.999074 -1.732622 0.444249
H  -4.480855 -2.500591 0.01053
H  -6.259431 0.753514 0.414307
H  -5.750409 0.848995 -1.267173
H  -4.929707 1.809822 -0.036359
H  -2.232386 1.430133 -1.799826
H  -1.918714 -0.886822 1.143717
H  -1.499524 -3.595621 2.191146
H  -0.568311 -2.226096 2.820583
H  0.267222 -3.652687 2.229421
H  -1.142932 3.430336 1.776738
H  3.332092 0.735217 -2.283329
H  3.626495 -0.116098 2.620533
H  0.363308 4.744849 -0.542448
H  -1.192763 5.276258 0.107962
H  0.256902 5.361425 1.104359
H  1.411152 2.531334 0.343705
H  0.580448 1.649142 1.634861
H  1.332442 3.200045 1.972048
H  5.326001 1.293688 1.463147
totalener: -1588.54774593 hartree
nucrepener: 2717.63893248 hartree
electener: -4306.18667841 hartree
oneelecener: -7578.93421550 hartree
twoeener: 3272.74753710 hartree
kineticenergy: 1582.86674294 hartree
xcener: -132.202074983035 hartree
chargesum: -0.0000000
charge: 0.062197 -0.201174 -0.389569 -0.311852 -0.464263 -0.208828 -0.206766 -0.248416 0.033243 0.045165 0.194241 0.098250 -0.271340 -0.276098 0.077139 -0.265199 0.461818 0.001479 0.095290 0.162152 -0.194418 -0.219595 -0.232452 -0.269830 0.278518 -0.130373 0.110266 0.054057 0.108244 0.085430 0.086285 0.094069 0.088484 0.077217 0.095452 0.144620 0.185609 0.097891 0.090577 0.097202 0.066797 0.118982 0.125993 0.084545 0.092222 0.079508 0.074121 0.110129 0.089062 0.123920
qa: 0.0622 -0.2012 -0.3896 -0.3119 -0.4643 -0.2088 -0.2068 -0.2484 0.0332 0.0452 0.1942 0.0983 -0.2713 -0.2761 0.0771 -0.2652 0.4618 0.0015 0.0953 0.1622 -0.1944 -0.2196 -0.2325 -0.2698 0.2785 -0.1304 0.1103 0.0541 0.1082 0.0854 0.0863 0.0941 0.0885 0.0772 0.0955 0.1446 0.1856 0.0979 0.0906 0.0972 0.0668 0.1190 0.1260 0.0845 0.0922 0.0795 0.0741 0.1101 0.0891 0.1239
va: 2.7001 1.0845 2.1144 2.1094 2.0177 3.1452 3.0989 3.0655 3.8195 3.8269 4.2495 3.8498 3.9292 3.9471 3.9361 3.9668 4.3389 3.7696 3.8992 3.8698 3.8679 4.0092 3.9335 3.8916 3.9937 3.8762 1.0198 1.0354 1.0211 1.0068 1.0046 1.0156 1.0070 1.0062 1.0105 1.0397 1.0381 1.0067 1.0127 1.0115 1.0217 1.0140 1.0195 1.0081 1.0108 1.0086 1.0102 1.0160 1.0115 1.0062
dispcorr: -0.029675974 hartree
energy: -1588.577421901929
dipole: -33.86871 33.38335 -0.48536 6.25830 -5.49149 0.76681 11.72335 -11.34852 0.37482
magnitude: 0.98187 au
magnitude: 2.49571 debye
