program: Orca
programVersion: 5.0.2
elementType: S F O O O N N N C C C C C C C C C C C C C C C C C C H H H H H H H H H H H H H H H H H H H H H H H H
charge: 0
multiplicity: 1
keywords: wb97x-d3
keywords: def2-TZVPP
keywords: def2/J RIJCOSX
keywords: DEFGRID2
keywords: scfconv7
keywords: smallprint printgap noloewdin
keywords: NOSOSCF
formula: C18H24FN3O3S
InChI: InChI=1/C18H24FN3O3S/c1-9(2)15(22-18(24)25-10(3)4)16(23)20-11(5)17-21-13-7-6-12(19)8-14(13)26-17/h6-11,15,20,22H,1-5H3
50 atoms
S  2.078125 -2.179758 -1.482474
F  5.749282 -0.02978 1.416855
O  -1.525957 -2.279017 0.568678
O  -0.92912 2.600178 0.536125
O  -2.399769 1.865501 -1.005836
N  -2.130896 0.78947 0.977556
N  -1.828868 -1.135943 -1.362575
N  0.65455 -0.266974 -0.510543
C  -3.703539 -0.900303 1.84681
C  -2.96738 -0.344515 0.628518
C  -2.054551 -1.377441 -0.04373
C  -0.669134 -1.685446 -2.026037
C  -4.626421 -2.041346 1.429607
C  -4.500847 0.196233 2.545531
C  0.587116 -1.280955 -1.288019
C  -0.764011 -3.187859 -2.272522
C  -1.851214 1.757114 0.070404
C  2.847277 -1.074596 -0.400374
C  1.909201 -0.121708 0.023776
C  -0.532182 3.691949 -0.31283
C  4.16052 -1.065493 0.053504
C  2.29331 0.860737 0.934453
C  0.431678 3.228546 -1.390043
C  0.085854 4.730034 0.601969
C  4.497692 -0.07542 0.948832
C  3.591885 0.882501 1.396846
H  -3.712509 0.015378 -0.085711
H  -2.961714 -1.30318 2.544053
H  -0.627408 -1.195284 -3.004101
H  -4.080726 -2.874832 0.991048
H  -5.370316 -1.700079 0.705525
H  -5.168556 -2.427704 2.293077
H  -5.0341 -0.211213 3.405222
H  -5.244976 0.630595 1.87391
H  -3.869042 1.007874 2.903269
H  -1.466509 0.649542 1.723074
H  -2.161711 -0.249895 -1.714006
H  -1.703479 -3.412163 -2.77488
H  -0.722902 -3.750232 -1.343964
H  0.04268 -3.526768 -2.924622
H  -1.425245 4.109707 -0.784304
H  4.891357 -1.796285 -0.264668
H  1.566897 1.588336 1.269685
H  1.354904 2.839427 -0.959561
H  -0.006843 2.456436 -2.018239
H  0.691807 4.071636 -2.031176
H  -0.611833 5.049693 1.37547
H  0.368737 5.608835 0.022791
H  0.986581 4.349362 1.086493
H  3.917591 1.630547 2.106527
totalener: -1588.54684354 hartree
nucrepener: 2702.85839176 hartree
electener: -4291.40523530 hartree
oneelecener: -7549.61550640 hartree
twoeener: 3258.21027110 hartree
kineticenergy: 1582.86950819 hartree
xcener: -132.204075562983 hartree
chargesum: 0.0000000
charge: 0.035615 -0.201155 -0.399417 -0.317586 -0.460885 -0.203777 -0.204990 -0.296798 0.061787 0.048241 0.212163 0.112584 -0.290969 -0.256779 0.138030 -0.296120 0.473937 -0.095817 0.289490 0.134251 -0.156379 -0.321963 -0.264627 -0.230150 0.250767 -0.099279 0.099062 0.044840 0.090401 0.106069 0.077534 0.082960 0.086496 0.076847 0.084959 0.144680 0.169298 0.088651 0.127242 0.085204 0.075910 0.118556 0.127341 0.078994 0.100027 0.097285 0.094370 0.082555 0.077419 0.123124
qa: 0.0356 -0.2012 -0.3994 -0.3176 -0.4609 -0.2038 -0.2050 -0.2968 0.0618 0.0482 0.2122 0.1126 -0.2910 -0.2568 0.1380 -0.2961 0.4739 -0.0958 0.2895 0.1343 -0.1564 -0.3220 -0.2646 -0.2302 0.2508 -0.0993 0.0991 0.0448 0.0904 0.1061 0.0775 0.0830 0.0865 0.0768 0.0850 0.1447 0.1693 0.0887 0.1272 0.0852 0.0759 0.1186 0.1273 0.0790 0.1000 0.0973 0.0944 0.0826 0.0774 0.1231
va: 2.6799 1.0849 2.1028 2.0817 2.0361 3.1509 3.1632 3.0647 3.8765 3.8629 4.2351 3.9508 3.9515 3.9343 3.9085 3.9058 4.3273 3.9674 3.7387 3.8507 3.8721 3.9833 3.9092 3.9383 4.0165 3.8754 1.0329 1.0342 0.9975 1.0163 1.0053 1.0056 1.0074 1.0059 1.0188 1.0417 1.0472 1.0147 1.0156 1.0030 1.0214 1.0109 1.0331 1.0028 1.0232 1.0134 1.0111 1.0084 1.0066 1.0073
dispcorr: -0.029490492 hartree
energy: -1588.576334036697
dipole: -34.29394 34.27023 -0.02371 11.30912 -10.81280 0.49633 2.51835 -2.92492 -0.40657
magnitude: 0.64203 au
magnitude: 1.63190 debye
