program: Orca
programVersion: 5.0.2
elementType: S F O O O N N N C C C C C C C C C C C C C C C C C C H H H H H H H H H H H H H H H H H H H H H H H H
charge: 0
multiplicity: 1
keywords: wb97x-d3
keywords: def2-TZVPP
keywords: def2/J RIJCOSX
keywords: DEFGRID2
keywords: scfconv7
keywords: smallprint printgap noloewdin
keywords: NOSOSCF
formula: C18H24FN3O3S
InChI: InChI=1/C18H24FN3O3S/c1-9(2)15(22-18(24)25-10(3)4)16(23)20-11(5)17-21-13-7-6-12(19)8-14(13)26-17/h6-11,15,20,22H,1-5H3
50 atoms
S  2.533167 -3.361055 -0.094898
F  7.286738 -2.452274 -1.8375
O  -2.32902 -1.03033 0.343907
O  -5.155469 2.239763 0.848284
O  -3.287073 3.338551 1.481229
N  -3.200105 1.473453 0.176203
N  -0.170568 -0.46038 0.640056
N  2.416801 -0.788332 -0.030166
C  -1.072536 1.861003 -1.048338
C  -1.773043 1.312193 0.215688
C  -1.468473 -0.174638 0.41038
C  0.31205 -1.816438 0.714366
C  -1.323639 3.355306 -1.206363
C  -1.486784 1.104544 -2.304612
C  1.723752 -1.839675 0.202892
C  0.224339 -2.387982 2.130883
C  -3.832222 2.43393 0.894887
C  3.934825 -2.478011 -0.590231
C  3.675894 -1.103616 -0.48267
C  -6.000169 3.167531 1.541866
C  5.153355 -2.964427 -1.044863
C  4.66685 -0.190546 -0.835081
C  -7.289275 2.424907 1.834292
C  -6.22804 4.411235 0.701855
C  6.102516 -2.027416 -1.387639
C  5.88365 -0.655779 -1.28856
H  -1.387661 1.861856 1.080961
H  0.005993 1.721484 -0.909544
H  -0.306455 -2.434049 0.056171
H  -0.736319 3.7496 -2.036704
H  -1.057494 3.912693 -0.308666
H  -2.372688 3.559407 -1.421804
H  -0.982374 1.514878 -3.180138
H  -2.561102 1.192119 -2.476128
H  -1.238269 0.043244 -2.256497
H  -3.732247 0.659397 -0.093237
H  0.526121 0.26844 0.621714
H  0.838326 -1.809416 2.820635
H  0.559262 -3.425198 2.16219
H  -0.809331 -2.358801 2.470624
H  -5.521695 3.450948 2.482894
H  5.361444 -4.021508 -1.135824
H  4.472935 0.869978 -0.752698
H  -7.107286 1.532478 2.432688
H  -7.970159 3.067783 2.392022
H  -7.792381 2.123066 0.914647
H  -5.296357 4.941877 0.51245
H  -6.897336 5.095377 1.224783
H  -6.689206 4.158746 -0.254233
H  6.670467 0.030039 -1.570803
totalener: -1588.55246655 hartree
nucrepener: 2467.24925040 hartree
electener: -4055.80171695 hartree
oneelecener: -7077.76829482 hartree
twoeener: 3021.96657787 hartree
kineticenergy: 1582.85715749 hartree
xcener: -132.201029957081 hartree
chargesum: 0.0000000
charge: 0.049527 -0.197291 -0.422789 -0.318747 -0.435201 -0.264493 -0.194446 -0.314383 0.061104 0.076801 0.251579 0.048652 -0.280334 -0.286532 0.205018 -0.258497 0.450670 -0.021439 0.160262 0.142447 -0.187870 -0.231093 -0.231733 -0.257933 0.265347 -0.123363 0.118758 0.025985 0.085473 0.089053 0.101165 0.080595 0.087603 0.085961 0.089584 0.160241 0.154110 0.091849 0.083587 0.107642 0.061434 0.122472 0.129268 0.091797 0.076297 0.081858 0.102441 0.080308 0.080351 0.126907
qa: 0.0495 -0.1973 -0.4228 -0.3187 -0.4352 -0.2645 -0.1944 -0.3144 0.0611 0.0768 0.2516 0.0487 -0.2803 -0.2865 0.2050 -0.2585 0.4507 -0.0214 0.1603 0.1424 -0.1879 -0.2311 -0.2317 -0.2579 0.2653 -0.1234 0.1188 0.0260 0.0855 0.0891 0.1012 0.0806 0.0876 0.0860 0.0896 0.1602 0.1541 0.0918 0.0836 0.1076 0.0614 0.1225 0.1293 0.0918 0.0763 0.0819 0.1024 0.0803 0.0804 0.1269
va: 2.6661 1.0906 2.0764 2.0960 2.0681 3.1821 3.1974 3.0609 3.7939 3.8979 4.2487 3.9250 3.9467 3.9400 3.8684 3.9187 4.3595 3.8665 3.9033 3.8821 3.9007 4.0395 3.9328 3.9021 4.0121 3.8889 1.0323 1.0319 1.0365 1.0055 1.0116 1.0091 1.0052 1.0141 1.0117 1.0552 1.0551 1.0086 1.0129 1.0132 1.0233 1.0114 1.0150 1.0107 1.0080 1.0091 1.0198 1.0100 1.0090 1.0056
dispcorr: -0.024094513 hartree
energy: -1588.576561061924
dipole: -48.51957 49.12794 0.60837 30.03704 -30.42636 -0.38931 4.34638 -4.44343 -0.09705
magnitude: 0.72877 au
magnitude: 1.85238 debye
