program: Orca
programVersion: 5.0.2
elementType: S F O O O N N N C C C C C C C C C C C C C C C C C C H H H H H H H H H H H H H H H H H H H H H H H H
charge: 0
multiplicity: 1
keywords: wb97x-d3
keywords: def2-TZVPP
keywords: def2/J RIJCOSX
keywords: DEFGRID2
keywords: scfconv7
keywords: smallprint printgap noloewdin
keywords: NOSOSCF
formula: C18H24FN3O3S
InChI: InChI=1/C18H24FN3O3S/c1-9(2)15(22-18(24)25-10(3)4)16(23)20-11(5)17-21-13-7-6-12(19)8-14(13)26-17/h6-11,15,20,22H,1-5H3
50 atoms
S  1.751348 -0.983492 -1.078296
F  6.576633 -2.095739 -2.484391
O  -1.940708 -2.031845 0.00826
O  -3.679312 2.767068 1.246194
O  -1.700871 2.565558 0.177371
N  -3.325538 0.989411 -0.010238
N  -0.622388 -0.231974 0.399846
N  2.691456 -1.418126 1.287562
C  -3.584289 -0.602496 -1.871227
C  -2.61691 0.10952 -0.916132
C  -1.711318 -0.850575 -0.127562
C  0.28425 -0.875736 1.318245
C  -4.107814 0.383907 -2.911843
C  -4.745491 -1.312274 -1.178605
C  1.6200 -1.103311 0.663855
C  0.428093 -0.084629 2.613129
C  -2.806717 2.147347 0.453349
C  3.417144 -1.418222 -0.938867
C  3.734926 -1.609812 0.415698
C  -3.281334 4.002941 1.865026
C  4.365263 -1.573845 -1.943621
C  5.033896 -1.968261 0.770297
C  -2.468672 3.725732 3.116101
C  -4.561655 4.757573 2.160694
C  5.63444 -1.930706 -1.548533
C  5.985016 -2.1293 -0.215384
H  -1.96154 0.740331 -1.524357
H  -2.994314 -1.364275 -2.387784
H  -0.134575 -1.860522 1.541534
H  -3.296289 0.838431 -3.482215
H  -4.678568 1.190027 -2.447556
H  -4.767368 -0.117322 -3.620951
H  -5.460027 -0.607017 -0.744594
H  -4.409471 -1.996404 -0.403083
H  -5.307462 -1.894749 -1.909111
H  -4.205761 0.679571 0.367088
H  -0.549791 0.772146 0.290995
H  0.802698 0.921562 2.420711
H  1.127217 -0.577794 3.284594
H  -0.538274 -0.005209 3.109775
H  -2.675527 4.573895 1.15756
H  4.131886 -1.429813 -2.989667
H  5.281039 -2.118115 1.81215
H  -2.191664 4.665537 3.594463
H  -3.043413 3.141299 3.83612
H  -1.547665 3.191267 2.886839
H  -5.135174 4.939776 1.252217
H  -4.326233 5.724077 2.605642
H  -5.193918 4.212136 2.862533
H  6.999863 -2.409395 0.031481
totalener: -1588.55047717 hartree
nucrepener: 2530.03511973 hartree
electener: -4118.58559690 hartree
oneelecener: -7203.52360875 hartree
twoeener: 3084.93801185 hartree
kineticenergy: 1582.85769643 hartree
xcener: -132.200579152213 hartree
chargesum: -0.0000000
charge: 0.031343 -0.202575 -0.398412 -0.316594 -0.468138 -0.256587 -0.294292 -0.279587 0.031626 0.074447 0.273142 0.114717 -0.262274 -0.306866 0.150565 -0.264520 0.501942 -0.014998 0.153989 0.138982 -0.183844 -0.248495 -0.253492 -0.228738 0.260130 -0.119475 0.107779 0.046021 0.097481 0.083125 0.080031 0.089333 0.057581 0.127196 0.089680 0.156313 0.191964 0.084211 0.106519 0.093422 0.068622 0.119402 0.126278 0.085650 0.082972 0.096029 0.092358 0.080264 0.082919 0.122855
qa: 0.0313 -0.2026 -0.3984 -0.3166 -0.4681 -0.2566 -0.2943 -0.2796 0.0316 0.0744 0.2731 0.1147 -0.2623 -0.3069 0.1506 -0.2645 0.5019 -0.0150 0.1540 0.1390 -0.1838 -0.2485 -0.2535 -0.2287 0.2601 -0.1195 0.1078 0.0460 0.0975 0.0831 0.0800 0.0893 0.0576 0.1272 0.0897 0.1563 0.1920 0.0842 0.1065 0.0934 0.0686 0.1194 0.1263 0.0856 0.0830 0.0960 0.0924 0.0803 0.0829 0.1229
va: 2.7160 1.0827 2.1111 2.1012 2.0289 3.1530 3.1583 3.1123 3.9029 3.7712 4.2511 3.8146 3.9284 3.9340 3.9791 3.9497 4.2828 3.8554 3.9476 3.8665 3.8830 4.0479 3.9116 3.9312 4.0116 3.8781 1.0246 1.0258 1.0442 1.0088 1.0110 1.0073 1.0051 1.0167 1.0077 1.0422 1.0386 1.0070 1.0225 1.0065 1.0213 1.0129 1.0189 1.0105 1.0090 1.0162 1.0107 1.0082 1.0088 1.0061
dispcorr: -0.024498434 hartree
energy: -1588.574975609138
dipole: -48.13999 46.91376 -1.22623 22.50315 -21.30639 1.19676 13.36521 -12.90349 0.46172
magnitude: 1.77456 au
magnitude: 4.51058 debye
