program: Orca
programVersion: 5.0.2
elementType: S N N N C C C C C C C C C H H H H H H H
charge: 0
multiplicity: 1
keywords: wb97x-d3
keywords: def2-TZVPP
keywords: def2/J RIJCOSX
keywords: DEFGRID2
keywords: scfconv7
keywords: smallprint printgap noloewdin
keywords: NOSOSCF
formula: C9H7N3S
InChI: InChI=1/C9H7N3S/c1-6-3-2-4-7-8(6)12-5-10-11-9(12)13-7/h2-5H,1H3
20 atoms
S  0.755413 1.99658 -0.000074
N  0.846496 -0.582402 -0.00022
N  2.902215 0.192905 0.000058
N  2.937611 -1.170507 0.000013
C  -0.522253 -0.311782 -0.000115
C  -0.73933 1.067192 -0.000096
C  -1.572822 -1.222662 0.000029
C  1.647049 0.515575 -0.000085
C  -2.021557 1.588517 -0.000055
C  -2.853973 -0.680809 0.000071
C  1.719503 -1.626085 -0.000141
C  -1.342425 -2.699952 0.000288
C  -3.078277 0.692621 0.000005
H  -2.193159 2.656325 -0.000049
H  -3.700482 -1.355574 0.000176
H  1.441514 -2.665768 -0.000272
H  -0.780279 -3.019322 -0.879468
H  -0.780384 -3.018951 0.88025
H  -2.289916 -3.235098 0.000344
H  -4.092632 1.067845 0.000018
elementType: S N C H
totalener: -909.66150411 hartree
nucrepener: 852.52696671 hartree
electener: -1762.18847082 hartree
oneelecener: -2933.31143121 hartree
twoeener: 1171.12296040 hartree
cpcmener: -0.02790560 hartree
kineticenergy: 906.86377173 hartree
xcener: -68.991474305364 hartree
chargesum: -0.0000000
charge: 0.070270 -0.037607 -0.238713 -0.262123 0.149627 -0.015458 -0.113537 0.089153 -0.148932 -0.121767 0.065555 -0.260167 -0.147369 0.147733 0.144648 0.179224 0.117669 0.117693 0.101516 0.162585
qa: 0.0703 -0.0376 -0.2387 -0.2621 0.1496 -0.0155 -0.1135 0.0892 -0.1489 -0.1218 0.0656 -0.2602 -0.1474 0.1477 0.1446 0.1792 0.1177 0.1177 0.1015 0.1626
va: 2.5384 3.4352 3.0423 3.0094 3.6777 3.8951 3.8291 4.2559 3.9025 3.8537 4.0410 3.9106 3.9073 0.9996 0.9993 0.9922 0.9870 0.9870 1.0069 0.9866
dispcorr: -0.007485539 hartree
energy: -909.668989644567
dipole: -11.61801 8.03253 -3.58548 -9.05752 8.31744 -0.74007 0.00110 -0.00118 -0.00008
magnitude: 3.66106 au
magnitude: 9.30568 debye
