program: Orca
programVersion: 5.0.2
elementType: F F F O O O N N C C C C C C C C C C C C C C C C H H H H H H H H H H H H H H H H H H H H H
charge: 0
multiplicity: 1
keywords: wb97x-d3
keywords: def2-TZVPP
keywords: def2/J RIJCOSX
keywords: DEFGRID2
keywords: scfconv7
keywords: smallprint printgap noloewdin
keywords: NOSOSCF
formula: C16H21F3N2O3
InChI: InChI=1/C16H21F3N2O3/c1-10(2)13(21-15(23)24-9-16(17,18)19)8-20-14(22)12-6-4-11(3)5-7-12/h4-7,10,13,20-21H,8-9H2,1-3H3
45 atoms
F  -0.882386 -3.789539 -1.544233
F  -0.355858 -3.722059 0.53648
F  -2.43518 -3.7436 -0.045826
O  0.016455 -1.264499 -0.746518
O  0.477734 -0.858071 1.42817
O  0.708317 2.057234 -1.715531
N  2.019408 -0.492921 -0.214608
N  1.263286 2.14266 0.475346
C  2.931772 0.327663 0.563086
C  4.389998 -0.081951 0.314018
C  2.660357 1.81797 0.299843
C  5.330122 0.624375 1.284816
C  4.852448 0.122525 -1.125674
C  0.820922 -0.860798 0.263555
C  0.374481 2.125972 -0.534204
C  -1.066072 2.174412 -0.15078
C  -1.526565 2.731567 1.039332
C  -1.994814 1.620419 -1.032386
C  -3.808576 2.150708 0.476958
C  -1.266805 -1.751084 -0.419858
C  -2.88019 2.723046 1.341595
C  -3.340631 1.598965 -0.715811
C  -5.269156 2.124909 0.807424
C  -1.229832 -3.26063 -0.365292
H  2.718018 0.12848 1.614645
H  4.437579 -1.152879 0.533585
H  3.246884 2.421989 0.991153
H  2.960959 2.099624 -0.707576
H  5.40486 1.693705 1.080875
H  5.004618 0.502451 2.31936
H  6.336035 0.210531 1.20552
H  5.851568 -0.294332 -1.258476
H  4.20586 -0.370561 -1.853789
H  4.907032 1.179493 -1.391175
H  2.109265 -0.443891 -1.220469
H  0.908608 2.056112 1.415818
H  -0.846327 3.199119 1.740479
H  -1.66303 1.185166 -1.965827
H  -1.945578 -1.4439 -1.215639
H  -1.643424 -1.353994 0.523097
H  -3.218346 3.172163 2.267172
H  -4.042197 1.146516 -1.40661
H  -5.644943 1.101517 0.850341
H  -5.471712 2.595554 1.76823
H  -5.854783 2.646083 0.048721
elementType: F O N C H
totalener: -1257.31109638 hartree
nucrepener: 2254.90312793 hartree
electener: -3512.21422432 hartree
oneelecener: -6205.57587982 hartree
twoeener: 2693.36165550 hartree
cpcmener: -0.04652998 hartree
kineticenergy: 1252.19393695 hartree
xcener: -115.099945702964 hartree
chargesum: -0.0000000
charge: -0.184149 -0.181393 -0.180992 -0.322410 -0.521982 -0.560454 -0.228994 -0.186333 0.159390 0.045918 -0.107232 -0.314679 -0.306784 0.463302 0.413660 0.025744 -0.185196 -0.223936 0.001104 -0.017226 -0.159574 -0.165400 -0.202883 0.501757 0.098292 0.043563 0.122275 0.114067 0.086291 0.097837 0.097018 0.099384 0.091857 0.085248 0.175787 0.180327 0.143157 0.143955 0.140125 0.126694 0.145932 0.145660 0.103892 0.092902 0.104478
qa: -0.1841 -0.1814 -0.1810 -0.3224 -0.5220 -0.5605 -0.2290 -0.1863 0.1594 0.0459 -0.1072 -0.3147 -0.3068 0.4633 0.4137 0.0257 -0.1852 -0.2239 0.0011 -0.0172 -0.1596 -0.1654 -0.2029 0.5018 0.0983 0.0436 0.1223 0.1141 0.0863 0.0978 0.0970 0.0994 0.0919 0.0852 0.1758 0.1803 0.1432 0.1440 0.1401 0.1267 0.1459 0.1457 0.1039 0.0929 0.1045
va: 1.1162 1.1180 1.1253 2.0626 1.9789 1.9389 3.2109 3.2025 3.8145 3.9041 3.8771 3.9410 3.9433 4.3835 4.1042 3.4915 4.0170 3.9732 3.7446 3.8616 3.9163 3.9236 3.9007 4.4524 1.0345 1.0203 1.0073 1.0227 0.9996 1.0028 1.0038 1.0024 1.0076 0.9999 1.0248 1.0072 1.0107 1.0257 1.0037 1.0234 0.9994 1.0003 0.9958 1.0056 0.9957
dispcorr: -0.024123624 hartree
energy: -1257.335220007455
dipole: 20.05069 -19.94255 0.10814 29.50626 -28.32871 1.17754 6.11580 -5.03209 1.08372
magnitude: 1.60398 au
magnitude: 4.07699 debye
