program: Orca
programVersion: 5.0.2
elementType: F F F O O O N N C C C C C C C C C C C C C C C C H H H H H H H H H H H H H H H H H H H H H
charge: 0
multiplicity: 1
keywords: wb97x-d3
keywords: def2-TZVPP
keywords: def2/J RIJCOSX
keywords: DEFGRID2
keywords: scfconv7
keywords: smallprint printgap noloewdin
keywords: NOSOSCF
formula: C16H21F3N2O3
InChI: InChI=1/C16H21F3N2O3/c1-10(2)13(21-15(23)24-9-16(17,18)19)8-20-14(22)12-6-4-11(3)5-7-12/h4-7,10,13,20-21H,8-9H2,1-3H3
45 atoms
F  -1.060566 -3.552092 -1.859758
F  -0.293471 -3.85999 0.121546
F  -2.42716 -3.752525 -0.202206
O  0.018681 -1.219824 -0.697799
O  0.649497 -1.110514 1.471358
O  0.698748 2.155823 -1.569219
N  2.044001 -0.474844 -0.217185
N  1.268394 2.108313 0.614878
C  2.968679 0.309311 0.581721
C  4.423788 -0.061466 0.26487
C  2.667566 1.807892 0.410747
C  5.390243 0.656152 1.201275
C  4.814814 0.16913 -1.191961
C  0.893477 -0.939382 0.294261
C  0.369561 2.137841 -0.384154
C  -1.071839 2.176433 0.000162
C  -1.984589 2.686709 -0.921472
C  -1.557055 1.673008 1.206803
C  -3.827494 2.226259 0.576008
C  -1.244244 -1.741603 -0.347619
C  -3.337836 2.718763 -0.632261
C  -2.9142 1.696572 1.484684
C  -5.288099 2.28541 0.900289
C  -1.251198 -3.235908 -0.573759
H  2.789255 0.047776 1.625637
H  4.504728 -1.13383 0.467806
H  3.249251 2.379973 1.13204
H  2.958244 2.154287 -0.57973
H  6.395694 0.248524 1.091685
H  5.450565 1.724956 0.988697
H  5.099715 0.538586 2.247004
H  4.162527 -0.354364 -1.89312
H  4.807282 1.228053 -1.456388
H  5.826467 -0.198895 -1.367964
H  2.05787 -0.308451 -1.214323
H  0.938833 2.077869 1.5669
H  -1.637677 3.069993 -1.871868
H  -0.895247 1.227691 1.938582
H  -1.985043 -1.277508 -0.999748
H  -1.517966 -1.527717 0.686005
H  -4.027035 3.128468 -1.360677
H  -3.268289 1.287579 2.423043
H  -5.899684 2.29817 -0.000965
H  -5.59756 1.438759 1.512203
H  -5.521511 3.191657 1.463252
elementType: F O N C H
totalener: -1257.31123374 hartree
nucrepener: 2245.62066393 hartree
electener: -3502.93189767 hartree
oneelecener: -6186.93391127 hartree
twoeener: 2684.00201360 hartree
cpcmener: -0.04468932 hartree
kineticenergy: 1252.18704681 hartree
xcener: -115.098686731735 hartree
chargesum: 0.0000000
charge: -0.183541 -0.181333 -0.180778 -0.318479 -0.521192 -0.564700 -0.232887 -0.173502 0.156768 0.048717 -0.098413 -0.316609 -0.308845 0.465992 0.402037 0.007143 -0.160284 -0.206040 0.008980 -0.006575 -0.179042 -0.166853 -0.201834 0.500065 0.097150 0.043538 0.122926 0.112179 0.097732 0.086506 0.098749 0.091560 0.085054 0.098760 0.175069 0.182177 0.138984 0.130789 0.140931 0.118163 0.145282 0.144021 0.097013 0.098809 0.105814
qa: -0.1835 -0.1813 -0.1808 -0.3185 -0.5212 -0.5647 -0.2329 -0.1735 0.1568 0.0487 -0.0984 -0.3166 -0.3088 0.4660 0.4020 0.0071 -0.1603 -0.2060 0.0090 -0.0066 -0.1790 -0.1669 -0.2018 0.5001 0.0972 0.0435 0.1229 0.1122 0.0977 0.0865 0.0987 0.0916 0.0851 0.0988 0.1751 0.1822 0.1390 0.1308 0.1409 0.1182 0.1453 0.1440 0.0970 0.0988 0.1058
va: 1.1178 1.1176 1.1251 2.0712 1.9794 1.9286 3.2015 3.2334 3.8036 3.8939 3.8610 3.9445 3.9422 4.3929 4.1482 3.4542 4.0147 3.9669 3.7370 3.8512 3.9501 3.9327 3.8990 4.4457 1.0392 1.0211 1.0066 1.0219 1.0040 0.9985 1.0022 1.0084 1.0004 1.0022 1.0249 1.0041 1.0267 1.0314 1.0034 1.0277 1.0003 1.0004 1.0024 1.0008 0.9940
dispcorr: -0.023931769 hartree
energy: -1257.335165509782
dipole: 20.17560 -20.18717 -0.01157 30.06660 -28.69011 1.37649 7.94313 -6.63720 1.30593
magnitude: 1.89745 au
magnitude: 4.82294 debye
