program: Gaussian 09
title: 000005878
version: EM64L-G09RevD.01
frameworkgroup: C1[X(C19H30O3)]
method: RPBEPBE
basis: SDD
operation: Freq
keyword: #pfreq=noraman
keyword: PBEPBE/SDD
title: #p freq=noraman PBEPBE/SDD
converged: YES YES NO NO
title: Mulliken charges:
elementType: O O O C C C C C C C C C C C C C C C C C C C H H H H H H H H H H H H H H H H H H H H H H H H H H H H H H
charge: -0.442167 -0.212826 -0.220683 -0.183991 0.440669 -0.113239 -0.101560 0.315172 0.205084 -0.545353 -0.542587 -0.545178 -0.055324 -0.500240 -0.515252 -0.475373 -0.886141 -0.412091 -0.820390 -0.609627 -0.791563 0.185515 0.218156 0.241564 0.186322 0.216797 0.224990 0.219619 0.213676 0.222556 0.220465 0.220059 0.222428 0.201837 0.214848 0.225204 0.203706 0.202056 0.238617 0.238518 0.225472 0.236724 0.219247 0.225541 0.239484 0.223855 0.253176 0.253827 0.241920 0.236345 0.210301 0.329835
chargesum: 0.00000
title: Mulliken charges with hydrogens summed into heavy atoms:
elementType: O O O C C C C C C C C C C C C C C C C C C C
charge: -0.112332 -0.212826 -0.220683 0.034164 0.440669 0.128325 0.084763 0.315172 0.205084 -0.103565 -0.109292 -0.102157 0.164735 -0.075975 -0.075201 -0.069611 -0.183535 0.043880 -0.131510 -0.102623 -0.102998 0.185515
polarizability: 2.53114935e+02 4.05363946e+00 1.86974485e+02 5.13250282e-01 1.29058322e-01 1.64188115e+02
1716.lowfreq: -15.3969 -5.4884 0.0002 0.0006 0.0007 13.3612 37.7029 57.5388 76.0189
frequency: 37.2621 57.5110 75.8242 98.9195 113.9419 128.1094 157.3221 183.1668 194.3992 207.6048 218.4895 235.9600 243.2032 250.1934 263.6646 288.6164 300.2061 310.1284 312.2267 329.6126 353.4530 368.3823 373.4448 382.6442 392.4387 403.3850 424.4965 431.1610 463.0490 476.9774 498.6521 515.8550 530.7309 541.6318 559.4987 568.5132 582.0979 624.1232 689.1805 695.6395 728.2704 754.4945 788.8425 805.6810 825.6834 842.6572 856.2707 869.4944 901.2003 903.9544 913.9492 924.8740 941.6094 953.8552 961.7976 965.5963 973.9118 986.2432 996.5093 1007.7914 1021.7898 1039.5566 1046.6277 1065.8299 1073.5315 1078.3608 1095.2263 1097.8891 1113.3867 1125.4274 1135.0511 1144.4218 1149.5792 1150.0219 1158.8226 1167.0019 1190.0620 1190.6332 1199.4100 1216.4416 1221.1228 1222.7323 1240.1012 1246.8910 1252.0547 1272.0154 1276.5240 1285.7344 1293.7632 1299.2859 1311.1930 1321.0000 1329.8938 1332.7610 1333.6321 1335.9465 1340.8887 1345.1108 1353.4173 1361.4252 1364.6809 1366.5963 1387.5891 1391.9121 1399.5901 1441.1187 1458.2963 1463.5731 1465.3077 1466.4033 1469.0945 1472.1823 1473.8640 1480.2401 1486.1415 1486.4737 1493.2759 1498.5668 1501.9246 1656.9307 2898.6856 2926.4774 2934.3782 2951.9799 2968.3708 2970.2295 2975.2852 2978.1244 2986.1022 2986.3255 2989.3922 2989.9592 2993.4712 2995.0778 3002.1101 3020.5254 3029.2196 3031.8542 3043.9026 3046.0618 3054.9339 3061.3735 3068.8031 3079.9812 3081.0990 3085.3039 3089.4702 3089.9127 3098.0626 3563.7347
redmass: 4.7001 4.0730 4.2420 2.4361 5.3936 2.7469 2.5423 1.8064 1.9382 2.3590 3.4153 1.9661 1.4484 1.3203 1.9241 1.9346 2.8507 2.6916 2.7094 2.2698 2.3567 1.9589 3.1183 2.1320 2.9406 1.9659 3.3378 3.5298 3.0239 2.5572 3.0003 2.7314 3.1094 2.3356 3.1412 3.9926 3.7729 3.8870 3.1244 3.0384 3.5137 3.6610 1.5678 2.2039 1.9504 2.0190 2.3613 2.0529 2.3063 1.6027 1.7715 1.8638 1.7005 2.3655 2.2759 1.9428 2.8668 2.4586 2.3011 1.8710 2.1199 1.8610 2.0530 2.0371 1.8866 2.3094 1.6672 2.2918 2.4628 2.3605 2.0882 2.0072 1.8402 1.7214 2.4019 2.1292 1.6567 1.7016 2.0167 1.4271 1.6565 1.8517 1.4787 1.4022 1.4273 1.4790 1.4287 1.4599 1.4471 1.3271 1.3968 1.3885 1.4397 1.4189 1.6518 1.4051 1.4508 1.4047 1.5304 1.4415 1.4557 1.3787 1.2068 1.2706 1.2148 1.0750 1.0628 1.0612 1.0850 1.0803 1.0810 1.0822 1.0776 1.0701 1.0675 1.0611 1.0666 1.0539 1.0603 12.1134 1.0810 1.0795 1.0823 1.0665 1.0620 1.0781 1.0592 1.0401 1.0618 1.0639 1.0621 1.0591 1.0369 1.0398 1.0638 1.0977 1.1004 1.1001 1.1005 1.1009 1.0960 1.0984 1.1017 1.0977 1.0962 1.0994 1.0987 1.0993 1.0997 1.0653
irintensity: 2.4699 1.6248 1.0969 1.8171 1.8746 3.6829 0.7094 0.4068 0.6642 1.5318 3.0113 2.6648 0.1565 0.5638 4.6378 8.1613 6.1612 2.9078 0.1675 4.4311 26.1089 16.7348 2.4387 24.0602 7.5871 54.7143 0.5479 0.4415 1.3699 1.5279 2.1141 3.2519 3.4089 1.8244 4.8884 1.1543 8.6127 1.5368 0.8406 0.0135 7.7518 17.0064 4.1501 0.5555 0.5259 4.2035 5.0296 1.2055 42.0775 5.9618 7.1815 4.1059 6.6927 7.9963 24.7365 24.9931 52.3645 1.3559 2.4909 23.5152 4.3807 16.9705 26.7266 15.0071 6.4790 14.0464 2.1709 71.4849 0.5485 22.1948 56.7906 36.6841 28.1649 0.5509 24.2024 36.2262 29.5557 9.9888 23.1983 0.9269 1.8062 2.4323 4.9483 0.5676 2.1409 4.2398 4.4005 1.3635 0.1470 6.6804 0.5454 8.7222 9.2178 2.5419 11.0789 6.3625 12.7379 3.6822 0.8637 0.8913 1.5229 5.9497 45.5385 11.9986 20.9915 12.0205 4.6393 4.9518 11.3121 9.1686 14.4967 13.2116 1.3301 4.9680 4.0295 6.2523 5.3884 10.8794 5.1312 374.0799 11.5134 12.0591 18.4707 17.2566 34.7966 20.4015 36.5239 22.4267 12.7603 54.5798 20.0350 36.3895 29.9463 20.4633 38.6048 43.4024 15.9691 53.1009 6.0489 59.3122 20.4987 48.5249 39.6323 42.0720 12.6681 15.6522 34.8331 38.5736 26.2379 6.1243
temp: 298.150 k
press: 1.00000 atm
elementType: 8 8 8 6 6 6 6 6 6 6 6 6 6 6 6 6 6 6 6 6 6 6 1 1 1 1 1 1 1 1 1 1 1 1 1 1 1 1 1 1 1 1 1 1 1 1 1 1 1 1 1 1
symmnumber: 1
zpe: 1198855.2 jmol-1
zpe.correction: 0.456620 hartree
zpe.thermalcorrener: 0.477675 hartree
zpe.thermalcorrenthalpy: 0.478619 hartree
zpe.thermalcorrgfe: 0.409517 hartree
zpe.sumelectzpe: -965.966305 hartree
zpe.sumelectthermal: -965.945250 hartree
zpe.sumelectthermalent: -965.944305 hartree
zpe.sumelectthermalfe: -966.013407 hartree
dipole: -4.6712 2.9909 1.0155
dipole: 5.6388
quadrupole: -192.3205 -135.1302 -128.5295
quadrupole: 3.7073 -0.6443 -1.1304
quadrupole: -40.3271 16.8632 23.4639 3.7073 -0.6443 -1.1304
hfenergy: -966.4229244 hartree
pointgroup: C01 [X(C19H30O3)]
dipole: 1.8424816 -1.1681933 0.402825 debye
polarizability: 253.0883755|4.1969873|186.9879938|-0.9980795|-0.3932979|164.2011649 unknown
InChI: InChI=1S/C19H30O3/c1-17-11-22-16(20)10-12(17)4-5-13-14(17)6-8-18(2)15(13)7-9-19(18,3)21/h12-15,21H,4-11H2,1-3H3
charge 0 multiplicity 1
52 atoms
O  5.11829 1.065702 0.308842
O  -4.113861 1.462835 -0.347142
O  -6.05637 0.278123 -0.319711
C  1.875719 -0.774308 -0.222494
C  2.617933 0.519469 0.230033
C  0.418349 -0.863556 0.275939
C  -0.363842 0.39748 -0.225459
C  -1.874935 0.363201 0.219593
C  4.070085 0.250223 -0.345918
C  1.85335 1.739537 -0.333671
C  0.367536 1.728007 0.12129
C  2.858609 -1.920355 0.131914
C  -2.507524 -0.961269 -0.326282
C  -0.264902 -2.164022 -0.215618
C  4.274227 -1.291489 -0.083471
C  -1.760587 -2.221646 0.160124
C  2.721471 0.636194 1.777196
C  -2.624731 1.515042 -0.486004
C  -2.047129 0.507638 1.755603
C  -4.014807 -1.032243 -0.009427
C  4.240567 0.609879 -1.831145
C  -4.811345 0.248021 -0.257553
H  1.815162 -0.729147 -1.333702
H  0.418523 -0.874329 1.38614
H  -0.368821 0.321421 -1.340154
H  1.882188 1.716213 -1.440771
H  2.335279 2.68569 -0.018424
H  0.314855 1.921364 1.209397
H  -0.151068 2.575659 -0.367227
H  2.703822 -2.81361 -0.498035
H  2.719096 -2.238328 1.183315
H  -2.393859 -0.920678 -1.433242
H  0.262218 -3.044443 0.198963
H  -0.163577 -2.223751 -1.320722
H  4.921135 -1.440727 0.802008
H  4.802097 -1.755114 -0.935423
H  -2.229971 -3.121732 -0.284566
H  -1.871455 -2.323572 1.258791
H  3.212843 1.587885 2.050922
H  1.732027 0.631222 2.263746
H  3.298791 -0.194206 2.226535
H  -2.372292 2.501644 -0.065628
H  -2.405169 1.517695 -1.57225
H  -1.529632 1.41043 2.124445
H  -3.110862 0.614631 2.032581
H  -1.641256 -0.358383 2.305673
H  -4.170888 -1.292296 1.057018
H  -4.506715 -1.835218 -0.587697
H  4.133101 1.697383 -1.980062
H  5.254439 0.322316 -2.158887
H  3.507095 0.086333 -2.468912
H  5.189089 0.790082 1.257429
