program: Orca
programVersion: 5.0.2
elementType: F F F O O O N N C C C C C C C C C C C C C C C C H H H H H H H H H H H H H H H H H H H H H
charge: 0
multiplicity: 1
keywords: wb97x-d3
keywords: def2-TZVPP
keywords: def2/J RIJCOSX
keywords: DEFGRID2
keywords: scfconv7
keywords: smallprint printgap noloewdin
keywords: NOSOSCF
formula: C16H21F3N2O3
InChI: InChI=1/C16H21F3N2O3/c1-10(2)13(21-15(23)24-9-16(17,18)19)8-20-14(22)12-6-4-11(3)5-7-12/h4-7,10,13,20-21H,8-9H2,1-3H3
45 atoms
F  -2.247389 -3.718634 0.542119
F  -0.723375 -3.943623 -0.96688
F  -0.164291 -3.468386 1.050833
O  0.04631 -1.249879 -0.603191
O  0.479528 -0.522448 1.494788
O  0.685435 2.07685 -1.934983
N  2.010657 -0.329852 -0.185909
N  1.244236 2.364487 0.237992
C  2.924627 0.575504 0.483122
C  4.388378 0.185033 0.241997
C  2.641623 2.033429 0.084183
C  4.76084 0.087998 -1.234427
C  4.733644 -1.108935 0.969026
C  0.827412 -0.675487 0.341184
C  0.352292 2.223594 -0.760838
C  -1.087838 2.227618 -0.372133
C  -1.985982 1.565338 -1.207278
C  -1.574418 2.828179 0.787562
C  -3.821515 2.082727 0.280116
C  -1.210012 -1.755296 -0.206147
C  -3.327867 1.485075 -0.877885
C  -2.922556 2.760291 1.100932
C  -5.279526 2.020939 0.616312
C  -1.082075 -3.230008 0.10689
H  2.736286 0.487145 1.554681
H  4.984372 0.989202 0.686374
H  3.235736 2.689811 0.720293
H  2.938927 2.228678 -0.943999
H  5.832356 -0.086884 -1.337484
H  4.256503 -0.744349 -1.730337
H  4.530647 0.998149 -1.789571
H  5.794886 -1.339342 0.865042
H  4.513835 -1.040046 2.035732
H  4.175997 -1.956787 0.567662
H  2.109343 -0.423009 -1.187633
H  0.893433 2.336427 1.183575
H  -1.635186 1.090601 -2.113973
H  -0.919589 3.374229 1.455445
H  -1.892998 -1.625427 -1.045761
H  -1.623667 -1.229733 0.655105
H  -4.003355 0.948164 -1.532981
H  -3.27995 3.240447 2.003629
H  -5.447869 2.098694 1.689695
H  -5.821146 2.842463 0.142731
H  -5.731728 1.093791 0.265653
elementType: F O N C H
totalener: -1257.31127446 hartree
nucrepener: 2266.75421216 hartree
electener: -3524.06548662 hartree
oneelecener: -6229.41743297 hartree
twoeener: 2705.35194636 hartree
cpcmener: -0.04635717 hartree
kineticenergy: 1252.19126857 hartree
xcener: -115.099136969146 hartree
chargesum: -0.0000000
charge: -0.180189 -0.183903 -0.181059 -0.324396 -0.523132 -0.558255 -0.237024 -0.188619 0.155039 0.042124 -0.091710 -0.312141 -0.305133 0.476678 0.415782 0.020008 -0.215494 -0.189298 -0.001808 -0.017784 -0.161401 -0.154340 -0.202272 0.499699 0.100114 0.042545 0.112703 0.108377 0.098157 0.082483 0.098961 0.098033 0.092357 0.082732 0.177664 0.179834 0.143025 0.142224 0.144097 0.124492 0.144203 0.145846 0.097065 0.105699 0.098018
qa: -0.1802 -0.1839 -0.1811 -0.3244 -0.5231 -0.5583 -0.2370 -0.1886 0.1550 0.0421 -0.0917 -0.3121 -0.3051 0.4767 0.4158 0.0200 -0.2155 -0.1893 -0.0018 -0.0178 -0.1614 -0.1543 -0.2023 0.4997 0.1001 0.0425 0.1127 0.1084 0.0982 0.0825 0.0990 0.0980 0.0924 0.0827 0.1777 0.1798 0.1430 0.1422 0.1441 0.1245 0.1442 0.1458 0.0971 0.1057 0.0980
va: 1.1260 1.1169 1.1173 2.0594 1.9772 1.9423 3.2218 3.1926 3.8081 3.8917 3.9010 3.9438 3.9271 4.3652 4.1120 3.5009 3.9699 4.0189 3.7405 3.8630 3.9170 3.9148 3.8996 4.4522 1.0289 1.0159 1.0120 1.0280 1.0037 1.0036 1.0047 1.0042 1.0041 1.0092 1.0219 1.0076 1.0271 1.0102 1.0021 1.0235 1.0008 0.9988 1.0023 0.9940 1.0010
dispcorr: -0.024337512 hartree
energy: -1257.335611974738
dipole: 17.56081 -17.48411 0.07671 25.41978 -24.26767 1.15211 1.30206 -0.42162 0.88044
magnitude: 1.45204 au
magnitude: 3.69079 debye
