program: Orca
programVersion: 5.0.2
elementType: F F F O O O N N C C C C C C C C C C C C C C C C H H H H H H H H H H H H H H H H H H H H H
charge: 0
multiplicity: 1
keywords: wb97x-d3
keywords: def2-TZVPP
keywords: def2/J RIJCOSX
keywords: DEFGRID2
keywords: scfconv7
keywords: smallprint printgap noloewdin
keywords: NOSOSCF
formula: C16H21F3N2O3
InChI: InChI=1/C16H21F3N2O3/c1-10(2)13(21-15(23)24-9-16(17,18)19)8-20-14(22)12-6-4-11(3)5-7-12/h4-7,10,13,20-21H,8-9H2,1-3H3
45 atoms
F  -0.151574 -3.718693 0.858944
F  -2.236935 -3.820553 0.311698
F  -0.704568 -3.878782 -1.208872
O  0.111926 -1.292185 -0.556823
O  0.665834 -0.809821 1.582019
O  0.572946 2.035236 -1.863821
N  2.074676 -0.356177 -0.15428
N  1.146122 2.289993 0.307361
C  2.932254 0.590194 0.534954
C  4.419945 0.303155 0.298546
C  2.555891 2.0268 0.142812
C  4.803465 0.244401 -1.176927
C  4.851454 -0.970164 1.015371
C  0.938494 -0.807509 0.398831
C  0.248381 2.170506 -0.684659
C  -1.190763 2.238084 -0.299229
C  -2.109647 2.681327 -1.250435
C  -1.664509 1.830091 0.945413
C  -3.940306 2.333782 0.291945
C  -1.137189 -1.811957 -0.155447
C  -3.458947 2.7389 -0.953448
C  -3.021157 1.876537 1.231179
C  -5.406849 2.371109 0.592984
C  -1.050709 -3.316213 -0.045657
H  2.74208 0.477321 1.603347
H  4.957725 1.14209 0.753054
H  3.117671 2.719475 0.769591
H  2.832477 2.234538 -0.889281
H  5.883673 0.133387 -1.278266
H  4.347545 -0.610459 -1.681222
H  4.521959 1.144805 -1.724321
H  4.615434 -0.930905 2.080239
H  4.362275 -1.851662 0.597605
H  5.927999 -1.120132 0.92169
H  2.107601 -0.336633 -1.164993
H  0.815335 2.403909 1.252833
H  -1.767511 2.996325 -2.227514
H  -0.994219 1.445902 1.703784
H  -1.858629 -1.555788 -0.931702
H  -1.487641 -1.39227 0.787949
H  -4.153086 3.100957 -1.702387
H  -3.368356 1.546431 2.20244
H  -5.937262 1.593799 0.0396
H  -5.603877 2.213726 1.652314
H  -5.848745 3.324747 0.303274
elementType: F O N C H
totalener: -1257.31209899 hartree
nucrepener: 2244.09798171 hartree
electener: -3501.41008070 hartree
oneelecener: -6183.99680353 hartree
twoeener: 2682.58672283 hartree
cpcmener: -0.04554803 hartree
kineticenergy: 1252.19039699 hartree
xcener: -115.098361130262 hartree
chargesum: 0.0000000
charge: -0.181054 -0.181501 -0.184167 -0.319662 -0.524278 -0.567095 -0.240759 -0.171048 0.156874 0.046660 -0.090110 -0.314069 -0.305911 0.483342 0.410342 0.018129 -0.165549 -0.215705 0.009812 -0.005821 -0.185103 -0.167596 -0.201636 0.498987 0.097625 0.041227 0.114312 0.105908 0.097389 0.082846 0.098603 0.092271 0.081908 0.098750 0.175894 0.183647 0.139675 0.134993 0.144211 0.116498 0.145251 0.144569 0.105341 0.093699 0.102298
qa: -0.1811 -0.1815 -0.1842 -0.3197 -0.5243 -0.5671 -0.2408 -0.1710 0.1569 0.0467 -0.0901 -0.3141 -0.3059 0.4833 0.4103 0.0181 -0.1655 -0.2157 0.0098 -0.0058 -0.1851 -0.1676 -0.2016 0.4990 0.0976 0.0412 0.1143 0.1059 0.0974 0.0828 0.0986 0.0923 0.0819 0.0988 0.1759 0.1836 0.1397 0.1350 0.1442 0.1165 0.1453 0.1446 0.1053 0.0937 0.1023
va: 1.1178 1.1244 1.1170 2.0695 1.9748 1.9260 3.2122 3.2203 3.7973 3.8773 3.8846 3.9419 3.9300 4.3657 4.1319 3.4539 4.0150 3.9742 3.7370 3.8546 3.9524 3.9378 3.8988 4.4417 1.0349 1.0162 1.0114 1.0282 1.0040 1.0044 1.0042 1.0040 1.0087 1.0039 1.0222 1.0017 1.0249 1.0315 1.0038 1.0269 1.0001 1.0009 0.9948 1.0051 0.9975
dispcorr: -0.023725328 hartree
energy: -1257.335824315717
dipole: 17.34665 -17.39292 -0.04627 28.01181 -26.39165 1.62017 2.81703 -1.82064 0.99639
magnitude: 1.90260 au
magnitude: 4.83602 debye
