program: Orca
programVersion: 5.0.2
elementType: F F F O O O N N C C C C C C C C C C C C C C C C H H H H H H H H H H H H H H H H H H H H H
charge: 0
multiplicity: 1
keywords: wb97x-d3
keywords: def2-TZVPP
keywords: def2/J RIJCOSX
keywords: DEFGRID2
keywords: scfconv7
keywords: smallprint printgap noloewdin
keywords: NOSOSCF
formula: C16H21F3N2O3
InChI: InChI=1/C16H21F3N2O3/c1-10(2)13(21-15(23)24-9-16(17,18)19)8-20-14(22)12-6-4-11(3)5-7-12/h4-7,10,13,20-21H,8-9H2,1-3H3
45 atoms
F  -1.586159 -1.460501 0.892407
F  -2.176334 -1.954942 -1.110652
F  -2.354779 -3.426498 0.454009
O  0.655985 -1.94452 -0.761034
O  1.361822 -1.553592 1.352193
O  0.656069 1.994478 -1.746323
N  2.267859 -0.465349 -0.430321
N  1.142258 1.914603 0.457128
C  3.127874 0.430024 0.314297
C  4.568127 0.35574 -0.206276
C  2.571982 1.865301 0.277615
C  5.113683 -1.063711 -0.10373
C  5.477344 1.321063 0.547126
C  1.428991 -1.319447 0.161489
C  0.284309 1.909057 -0.57654
C  -1.165109 1.805985 -0.248056
C  -1.698956 2.161227 0.99094
C  -2.027839 1.344734 -1.237909
C  -3.924722 1.572341 0.243334
C  -0.195525 -2.974883 -0.307808
C  -3.05773 2.046628 1.227421
C  -3.385226 1.221482 -0.990848
C  -5.394298 1.464486 0.509778
C  -1.58149 -2.441315 -0.015795
H  3.124259 0.088638 1.351443
H  4.554649 0.65081 -1.262841
H  3.036982 2.450504 1.069426
H  2.824838 2.346877 -0.666466
H  4.522357 -1.779613 -0.674122
H  6.135301 -1.10902 -0.483757
H  5.132662 -1.400524 0.935445
H  5.464531 1.115692 1.620258
H  6.507685 1.215264 0.205195
H  5.198676 2.364971 0.402972
H  2.188345 -0.321613 -1.427537
H  0.794624 1.688054 1.376322
H  -1.070682 2.554139 1.780626
H  -1.63819 1.06834 -2.208557
H  0.192356 -3.479802 0.577549
H  -0.267433 -3.708419 -1.111544
H  -3.453717 2.337561 2.192897
H  -4.035773 0.847911 -1.772132
H  -5.84815 2.452894 0.60215
H  -5.909487 0.937797 -0.292061
H  -5.590907 0.936165 1.443168
elementType: F O N C H
totalener: -1257.31091367 hartree
nucrepener: 2288.79030779 hartree
electener: -3546.10122146 hartree
oneelecener: -6274.22608227 hartree
twoeener: 2728.12486080 hartree
cpcmener: -0.04715831 hartree
kineticenergy: 1252.20118521 hartree
xcener: -115.100467338446 hartree
chargesum: -0.0000000
charge: -0.182325 -0.186178 -0.181431 -0.327115 -0.543552 -0.569396 -0.217429 -0.185382 0.098631 0.043423 -0.086577 -0.298682 -0.308683 0.526827 0.441295 0.003531 -0.187198 -0.195158 0.012907 -0.015684 -0.173181 -0.184978 -0.202436 0.503528 0.096349 0.048259 0.121363 0.108062 0.090820 0.098000 0.085840 0.090967 0.093264 0.095176 0.175110 0.179925 0.139746 0.136163 0.119710 0.146029 0.145361 0.144118 0.105544 0.093322 0.102116
qa: -0.1823 -0.1862 -0.1814 -0.3271 -0.5436 -0.5694 -0.2174 -0.1854 0.0986 0.0434 -0.0866 -0.2987 -0.3087 0.5268 0.4413 0.0035 -0.1872 -0.1952 0.0129 -0.0157 -0.1732 -0.1850 -0.2024 0.5035 0.0963 0.0483 0.1214 0.1081 0.0908 0.0980 0.0858 0.0910 0.0933 0.0952 0.1751 0.1799 0.1397 0.1362 0.1197 0.1460 0.1454 0.1441 0.1055 0.0933 0.1021
va: 1.1140 1.1114 1.1251 2.0738 1.9557 1.9256 3.2104 3.2256 3.8192 3.8776 3.8542 3.9258 3.9496 4.2789 4.0783 3.4897 4.0009 3.9833 3.7222 3.9012 3.9351 3.9263 3.8996 4.3534 1.0407 1.0200 1.0014 1.0280 1.0126 1.0052 1.0026 1.0005 1.0047 1.0022 1.0276 1.0069 1.0128 1.0302 1.0253 1.0048 0.9994 1.0015 0.9950 1.0051 0.9977
dispcorr: -0.023792323 hartree
energy: -1257.334705993206
dipole: 26.33230 -25.56893 0.76337 17.17505 -17.30887 -0.13382 3.33964 -2.54457 0.79506
magnitude: 1.11030 au
magnitude: 2.82216 debye
