program: Orca
programVersion: 5.0.2
elementType: F F F O O O N N C C C C C C C C C C C C C C C C H H H H H H H H H H H H H H H H H H H H H
charge: 0
multiplicity: 1
keywords: wb97x-d3
keywords: def2-TZVPP
keywords: def2/J RIJCOSX
keywords: DEFGRID2
keywords: scfconv7
keywords: smallprint printgap noloewdin
keywords: NOSOSCF
formula: C16H21F3N2O3
InChI: InChI=1/C16H21F3N2O3/c1-10(2)13(21-15(23)24-9-16(17,18)19)8-20-14(22)12-6-4-11(3)5-7-12/h4-7,10,13,20-21H,8-9H2,1-3H3
45 atoms
F  -1.15405 -3.335795 -1.092512
F  -2.399309 -3.471708 0.664014
F  -1.648333 -1.558069 0.00461
O  1.003891 -2.467766 0.415537
O  0.772419 -0.590638 1.659566
O  0.847724 3.146022 0.559024
N  2.382624 -0.789087 0.054341
N  0.798858 1.473252 -0.942311
C  2.877831 0.574718 0.074811
C  4.41094 0.625703 0.029908
C  2.237374 1.380276 -1.059615
C  5.015369 0.011559 -1.229436
C  5.017638 -0.000776 1.279079
C  1.338062 -1.205903 0.778011
C  0.203572 2.324191 -0.092101
C  -1.283046 2.258578 0.025794
C  -1.889759 3.003547 1.03699
C  -2.098456 1.508902 -0.819958
C  -4.082119 2.239897 0.359696
C  -0.122041 -3.066138 1.017821
C  -3.263266 2.993466 1.199466
C  -3.474072 1.499014 -0.650185
C  -5.570521 2.255291 0.52399
C  -1.336128 -2.85289 0.141782
H  2.573321 1.016175 1.024538
H  4.66279 1.691261 0.034662
H  2.668347 2.381125 -1.089004
H  2.451781 0.914413 -2.021175
H  4.644576 0.476633 -2.143432
H  6.098704 0.137906 -1.22262
H  4.823585 -1.06185 -1.296699
H  6.097773 0.150498 1.298616
H  4.606149 0.440737 2.188545
H  4.839625 -1.07647 1.319552
H  2.692453 -1.384044 -0.701432
H  0.263285 0.721504 -1.345741
H  -1.284478 3.596535 1.70901
H  -1.689626 0.933747 -1.640562
H  -0.320603 -2.687527 2.021238
H  0.079753 -4.135042 1.089513
H  -3.70729 3.579528 1.99509
H  -4.084353 0.907388 -1.321423
H  -6.036432 1.391965 0.051155
H  -5.856174 2.264123 1.575703
H  -6.001018 3.149387 0.068328
elementType: F O N C H
totalener: -1257.31229053 hartree
nucrepener: 2239.03356511 hartree
electener: -3496.34585564 hartree
oneelecener: -6174.42906078 hartree
twoeener: 2678.08320514 hartree
cpcmener: -0.05546631 hartree
kineticenergy: 1252.18571123 hartree
xcener: -115.097311559830 hartree
chargesum: -0.0000000
charge: -0.185517 -0.180325 -0.172807 -0.323519 -0.540021 -0.572557 -0.249340 -0.192708 0.149275 0.040473 -0.112456 -0.306466 -0.304168 0.516189 0.435609 0.007417 -0.164324 -0.227944 -0.000252 -0.013741 -0.175482 -0.143106 -0.200993 0.485234 0.099295 0.046306 0.107491 0.129834 0.094627 0.096615 0.083766 0.099238 0.094035 0.082626 0.176955 0.185781 0.139886 0.137370 0.122792 0.144722 0.145291 0.144076 0.095328 0.099845 0.105650
qa: -0.1855 -0.1803 -0.1728 -0.3235 -0.5400 -0.5726 -0.2493 -0.1927 0.1493 0.0405 -0.1125 -0.3065 -0.3042 0.5162 0.4356 0.0074 -0.1643 -0.2279 -0.0003 -0.0137 -0.1755 -0.1431 -0.2010 0.4852 0.0993 0.0463 0.1075 0.1298 0.0946 0.0966 0.0838 0.0992 0.0940 0.0826 0.1770 0.1858 0.1399 0.1374 0.1228 0.1447 0.1453 0.1441 0.0953 0.0998 0.1056
va: 1.1138 1.1258 1.1168 2.0724 1.9618 1.9271 3.2298 3.2204 3.7264 3.8697 3.9422 3.9526 3.9354 4.3082 4.1011 3.5439 4.0134 3.9871 3.7429 3.8843 3.9449 3.9060 3.8991 4.3942 1.0443 1.0169 1.0232 0.9998 1.0031 1.0038 1.0030 1.0044 1.0034 1.0092 1.0188 1.0079 1.0286 1.0141 1.0251 1.0046 1.0003 1.0004 1.0035 0.9997 0.9943
dispcorr: -0.022377395 hartree
energy: -1257.334667926797
dipole: 22.23925 -21.72417 0.51507 18.94724 -21.10953 -2.16229 -0.75822 -1.07629 -1.83451
magnitude: 2.88205 au
magnitude: 7.32560 debye
