program: Orca
programVersion: 5.0.2
elementType: F F F O O O N N C C C C C C C C C C C C C C C C H H H H H H H H H H H H H H H H H H H H H
charge: 0
multiplicity: 1
keywords: wb97x-d3
keywords: def2-TZVPP
keywords: def2/J RIJCOSX
keywords: DEFGRID2
keywords: scfconv7
keywords: smallprint printgap noloewdin
keywords: NOSOSCF
formula: C16H21F3N2O3
InChI: InChI=1/C16H21F3N2O3/c1-10(2)13(21-15(23)24-9-16(17,18)19)8-20-14(22)12-6-4-11(3)5-7-12/h4-7,10,13,20-21H,8-9H2,1-3H3
45 atoms
F  -1.336076 -2.083128 -0.247108
F  -0.615216 -3.94072 -1.038278
F  -2.074014 -3.947081 0.550552
O  1.253558 -2.703578 0.597627
O  0.88347 -0.807221 1.779471
O  0.725613 3.615998 -0.546726
N  2.327238 -0.870915 0.01536
N  0.682808 1.404122 -1.020482
C  2.749409 0.518033 0.003422
C  4.278842 0.644208 0.019581
C  2.110015 1.239616 -1.184998
C  4.959206 0.025389 -1.197334
C  4.852062 0.076986 1.311914
C  1.441124 -1.38729 0.868679
C  0.112726 2.552289 -0.622589
C  -1.340695 2.490642 -0.298009
C  -1.917681 1.398849 0.34458
C  -2.139973 3.590965 -0.60175
C  -4.076317 2.4936 0.347637
C  0.117209 -3.345083 1.133142
C  -3.266348 1.406917 0.666755
C  -3.489941 3.582651 -0.297051
C  -5.52789 2.510452 0.716945
C  -0.981754 -3.329866 0.093209
H  2.376021 0.983166 0.917247
H  4.481467 1.720066 0.005141
H  2.564235 2.220669 -1.308064
H  2.293208 0.685803 -2.107127
H  6.034574 0.202526 -1.154804
H  4.818093 -1.056966 -1.240901
H  4.600877 0.448974 -2.136389
H  5.927046 0.254212 1.366969
H  4.39582 0.54098 2.188385
H  4.694796 -1.000535 1.385227
H  2.660162 -1.463872 -0.732004
H  0.113311 0.572336 -1.064913
H  -1.317255 0.54582 0.633338
H  -1.711719 4.45321 -1.096443
H  -0.238487 -2.883285 2.055112
H  0.391809 -4.377045 1.351761
H  -3.693109 0.553391 1.179391
H  -4.099001 4.439106 -0.560258
H  -5.678488 3.015841 1.673322
H  -6.123537 3.043243 -0.023698
H  -5.928857 1.502664 0.816959
elementType: F O N C H
totalener: -1257.31122028 hartree
nucrepener: 2199.55872340 hartree
electener: -3456.86994369 hartree
oneelecener: -6094.27905534 hartree
twoeener: 2637.40911165 hartree
cpcmener: -0.05026587 hartree
kineticenergy: 1252.18436622 hartree
xcener: -115.094937140225 hartree
chargesum: -0.0000000
charge: -0.179445 -0.183085 -0.179632 -0.326255 -0.534651 -0.576667 -0.232962 -0.185090 0.130866 0.038075 -0.093277 -0.304580 -0.308312 0.511554 0.433089 -0.000735 -0.178989 -0.171427 0.010777 -0.009453 -0.186046 -0.183141 -0.201421 0.488235 0.102274 0.046156 0.096855 0.129148 0.096493 0.083677 0.094473 0.101097 0.095352 0.084133 0.177889 0.180225 0.141315 0.140695 0.123253 0.142833 0.141243 0.144614 0.105650 0.098538 0.096659
qa: -0.1794 -0.1831 -0.1796 -0.3263 -0.5347 -0.5767 -0.2330 -0.1851 0.1309 0.0381 -0.0933 -0.3046 -0.3083 0.5116 0.4331 -0.0007 -0.1790 -0.1714 0.0108 -0.0095 -0.1860 -0.1831 -0.2014 0.4882 0.1023 0.0462 0.0969 0.1291 0.0965 0.0837 0.0945 0.1011 0.0954 0.0841 0.1779 0.1802 0.1413 0.1407 0.1233 0.1428 0.1412 0.1446 0.1056 0.0985 0.0967
va: 1.1098 1.1172 1.1266 2.0695 1.9666 1.9202 3.2219 3.2280 3.7787 3.8831 3.9035 3.9505 3.9342 4.3086 4.1004 3.5706 3.9788 4.0053 3.7328 3.8878 3.9744 3.9425 3.8976 4.3895 1.0347 1.0161 1.0412 0.9971 1.0044 1.0033 1.0031 1.0043 1.0033 1.0080 1.0186 1.0062 1.0214 1.0208 1.0254 1.0042 1.0035 1.0002 0.9940 1.0006 1.0025
dispcorr: -0.021997615 hartree
energy: -1257.333217895456
dipole: 19.19235 -18.69161 0.50074 22.35985 -24.78042 -2.42058 1.78283 -2.48064 -0.69782
magnitude: 2.56844 au
magnitude: 6.52845 debye
