program: Gaussian 09
title: 000064514
version: EM64L-G09RevD.01
frameworkgroup: C1[X(C12H19N3O2)]
method: RPBEPBE
basis: SDD
operation: Freq
keyword: #p
keyword: freq=noraman
keyword: PBEPBE/SDD
title: #p freq=noraman PBEPBE/SDD
converged: YES YES NO NO
title: Mulliken charges:
elementType: O O N N N C C C C C C C C C C C C H H H H H H H H H H H H H H H H H H H
charge: -0.272635 -0.250405 -0.428121 -0.162515 0.031207 -0.136820 -0.165225 -0.087884 -0.079747 -0.052949 -0.469987 -0.474369 -0.468292 -0.494127 -0.463478 0.310018 -0.628310 0.241021 0.221507 0.200491 0.202996 0.262486 0.200689 0.207335 0.209735 0.202303 0.207299 0.201028 0.208727 0.198632 0.198855 0.199661 0.345867 0.275663 0.254554 0.254789
chargesum: 0.00000
title: Mulliken charges with hydrogens summed into heavy atoms:
elementType: O O N N N C C C C C C C C C C C C
charge: -0.272635 -0.250405 -0.082253 -0.162515 0.031207 0.104202 0.056283 0.112607 0.123249 0.209537 -0.061964 -0.062332 -0.059965 -0.086768 -0.064963 0.310018 0.156697
polarizability: 1.82892019e+02 -6.28295983e+00 1.49679832e+02 4.05309654e+00 9.41638419e-01 1.16131762e+02
1716.lowfreq: -0.0005 -0.0005 -0.0002 10.0414 13.6640 19.7750 29.2332 57.3335 70.4527
frequency: 26.9386 55.1228 70.2496 93.9776 148.8467 169.6151 186.4965 212.1221 272.9560 304.0436 309.6954 326.5121 359.9861 371.2713 393.6119 423.0504 424.5608 433.9778 443.1630 472.7049 570.0200 628.6847 634.3646 671.9036 683.3420 705.5642 729.0384 764.3303 796.6044 803.8516 813.4167 851.4273 868.3186 869.6122 903.8533 916.6608 921.9456 941.0566 968.3340 983.0428 1013.7149 1042.4587 1049.3176 1052.2417 1070.2401 1092.5162 1100.1702 1101.7122 1107.8715 1113.7074 1116.5992 1119.1620 1152.0822 1180.8194 1196.8806 1212.7856 1252.0081 1265.4689 1274.2017 1288.4694 1295.2292 1297.7880 1306.2415 1320.0656 1325.3171 1327.3003 1340.8186 1343.8203 1354.0328 1355.1748 1358.8913 1366.3115 1372.2174 1411.9423 1456.2404 1460.4903 1463.0426 1465.3962 1469.6598 1472.2135 1483.2242 1498.3131 1665.3303 2959.9443 2965.3334 2968.2897 2969.0041 2970.7669 2995.0420 2998.6939 3004.2118 3005.6010 3008.3531 3016.4940 3019.7380 3022.2744 3026.5073 3030.7687 3031.8771 3088.5657 3146.8446 3494.4199
redmass: 4.8802 4.6630 4.8937 4.7371 1.1407 5.2470 5.0668 5.6402 3.1824 3.9125 2.0419 2.8987 3.6065 2.2721 6.0838 2.4183 1.9498 3.8476 2.5660 8.2382 5.2227 3.7075 3.8205 3.1895 1.1782 9.2223 5.3634 4.1170 3.0544 3.2306 2.8342 3.8087 1.5782 1.5827 2.1924 2.1204 2.3706 2.2724 2.2288 2.0579 5.0190 1.8338 1.9473 2.9725 1.5704 1.9764 1.5198 1.6507 1.0252 1.0138 1.3236 1.0208 2.5767 1.2210 2.3182 1.0545 1.8561 2.6386 1.8910 1.9330 1.9831 2.0575 2.2089 1.4423 1.3186 1.3171 1.4183 1.4181 1.5110 4.5718 1.7068 1.5501 1.5247 1.1890 1.0860 1.0871 1.0437 1.1818 1.0977 1.0714 1.2037 1.4292 10.1587 1.0639 1.0621 1.0616 1.0611 1.0616 1.0841 1.0840 1.0337 1.0844 1.0847 1.0952 1.0927 1.1020 1.1013 1.1018 1.1017 1.1008 1.1010 1.0767
irintensity: 0.0139 0.0518 0.0715 11.6614 0.8910 6.0944 3.4708 3.0116 2.6504 4.7278 0.6938 16.4502 6.6795 5.2762 1.4489 1.0350 0.1155 0.9451 1.7444 2.0937 7.8229 2.4346 3.5499 8.9268 59.5640 23.1380 19.6853 9.9793 6.0307 4.1529 7.1809 17.5875 1.0128 0.5225 35.6976 14.6884 142.7038 46.3674 2.2869 12.9461 3.7246 0.7628 3.7659 13.8958 1.9343 16.2194 8.9477 8.0469 0.3579 0.4917 0.3075 0.8592 65.3085 1.5623 5.1208 5.5165 1.6857 2.9256 15.8067 5.8964 2.4532 0.4811 2.7154 3.1482 0.0555 1.3039 10.0716 5.4633 6.7078 131.3221 12.4973 0.8021 0.6847 37.3558 6.8091 5.9065 20.3219 79.5520 32.6865 3.9531 170.4611 314.7556 248.7680 31.1818 29.7824 28.7957 25.3806 24.9704 97.2969 149.6843 20.0773 66.4965 33.0596 36.1698 1.7517 3.5746 39.8399 78.6972 82.3756 13.7442 0.2805 35.0632
temp: 298.150 k
press: 1.00000 atm
elementType: 8 8 7 7 7 6 6 6 6 6 6 6 6 6 6 6 6 1 1 1 1 1 1 1 1 1 1 1 1 1 1 1 1 1 1 1
symmnumber: 1
zpe: 803044.1 jmol-1
zpe.correction: 0.305863 hartree
zpe.thermalcorrener: 0.320695 hartree
zpe.thermalcorrenthalpy: 0.321639 hartree
zpe.thermalcorrgfe: 0.263665 hartree
zpe.sumelectzpe: -782.040634 hartree
zpe.sumelectthermal: -782.025803 hartree
zpe.sumelectthermalent: -782.024859 hartree
zpe.sumelectthermalfe: -782.082833 hartree
dipole: 2.6358 -0.0908 0.1335
dipole: 2.6407
quadrupole: -100.6971 -112.5689 -99.1594
quadrupole: 7.6189 0.9435 0.5282
quadrupole: 3.4447 -8.4271 4.9824 7.6189 0.9435 0.5282
hfenergy: -782.3464978 hartree
pointgroup: C01 [X(C12H19N3O2)]
dipole: 1.0364769 0.0352529 -0.0623082 debye
polarizability: 182.8302386|6.3655758|149.5515186|-4.5441507|2.0052317|116.3218562 unknown
InChI: InChI=1S/C12H19N3O2/c1-15(14-17)12(16)13-11-9-3-7-2-8(5-9)6-10(11)4-7/h7-11,13H,2-6H2,1H3
charge 0 multiplicity 1
36 atoms
O  -1.995269 2.118849 0.042615
O  -4.300156 -1.866133 0.043164
N  -0.910332 0.07599 -0.361049
N  -3.24946 0.118341 0.035801
N  -3.176555 -1.263585 -0.08823
C  1.136911 0.812457 0.916833
C  1.339268 -0.282463 -1.37003
C  3.411003 0.615686 -0.19552
C  2.248278 -1.461646 0.692208
C  0.454106 0.631268 -0.475494
C  2.510047 1.505808 0.702652
C  1.347733 -0.569638 1.591198
C  2.715344 0.412647 -1.569524
C  1.563904 -1.662609 -0.688496
C  3.621412 -0.764502 0.486476
C  -1.991851 0.863794 -0.092057
C  -4.517782 0.814903 0.302139
H  0.487667 1.451805 1.544793
H  0.842378 -0.419115 -2.350879
H  4.390343 1.110208 -0.348034
H  2.399347 -2.446145 1.176622
H  0.354903 1.627869 -0.947338
H  2.996852 1.67551 1.683404
H  2.366499 2.500343 0.234493
H  0.372612 -1.064787 1.770459
H  1.822029 -0.429073 2.58243
H  2.579364 1.388898 -2.076331
H  3.350134 -0.211788 -2.229113
H  2.201757 -2.290512 -1.341391
H  0.611671 -2.219208 -0.564322
H  4.280437 -1.40029 -0.138551
H  4.12774 -0.630385 1.463335
H  -1.071104 -0.934084 -0.426345
H  -4.294208 1.889359 0.358935
H  -4.953614 0.455672 1.250508
H  -5.239305 0.606757 -0.50666
