program: Orca
programVersion: 5.0.2
elementType: F F F O O O N N C C C C C C C C C C C C C C C C H H H H H H H H H H H H H H H H H H H H H
charge: 0
multiplicity: 1
keywords: wb97x-d3
keywords: def2-TZVPP
keywords: def2/J RIJCOSX
keywords: DEFGRID2
keywords: scfconv7
keywords: smallprint printgap noloewdin
keywords: NOSOSCF
formula: C16H21F3N2O3
InChI: InChI=1/C16H21F3N2O3/c1-10(2)13(21-15(23)24-9-16(17,18)19)8-20-14(22)12-6-4-11(3)5-7-12/h4-7,10,13,20-21H,8-9H2,1-3H3
45 atoms
F  -2.528222 -3.408259 0.365018
F  -2.028455 -1.731541 -0.899482
F  -1.021267 -3.612766 -1.164857
O  0.544802 -1.716535 0.046968
O  1.30204 -0.811384 1.960338
O  0.556254 1.60059 -1.982404
N  2.326361 -0.407087 -0.037164
N  1.258139 2.192543 0.082114
C  3.175356 0.679769 0.40665
C  4.656298 0.423746 0.099369
C  2.667715 2.012472 -0.165089
C  4.945947 0.211332 -1.383264
C  5.175572 -0.750342 0.921016
C  1.392057 -0.94964 0.757734
C  0.3076 1.856757 -0.809475
C  -1.095641 1.820488 -0.304493
C  -2.134258 2.032738 -1.210622
C  -1.414768 1.514381 1.015087
C  -3.77963 1.664341 0.524233
C  -0.483865 -2.358585 0.771093
C  -3.451854 1.968026 -0.797892
C  -2.739752 1.435753 1.419287
C  -5.211898 1.584581 0.954626
C  -1.516802 -2.778815 -0.244412
H  3.074906 0.732401 1.492249
H  5.189538 1.325092 0.422053
H  3.218897 2.830753 0.300361
H  2.84391 2.077769 -1.237366
H  4.607289 1.041474 -2.004721
H  6.019997 0.110293 -1.546555
H  4.479492 -0.701033 -1.762151
H  6.244701 -0.897526 0.758596
H  5.024807 -0.591821 1.990626
H  4.672508 -1.680656 0.649195
H  2.236071 -0.554037 -1.033043
H  0.985598 2.419725 1.025398
H  -1.910444 2.260555 -2.244811
H  -0.641866 1.303365 1.743662
H  -0.957787 -1.695355 1.497614
H  -0.111842 -3.240885 1.298798
H  -4.242582 2.150095 -1.516433
H  -2.964099 1.184688 2.44893
H  -5.757235 0.835802 0.377585
H  -5.302202 1.323964 2.008353
H  -5.723464 2.536649 0.802139
elementType: F O N C H
totalener: -1257.31994854 hartree
nucrepener: 2271.81933268 hartree
electener: -3529.13928122 hartree
oneelecener: -6239.57020836 hartree
twoeener: 2710.43092714 hartree
cpcmener: -0.03795941 hartree
kineticenergy: 1252.19230760 hartree
xcener: -115.096686216043 hartree
chargesum: -0.0000000
charge: -0.180864 -0.175235 -0.180034 -0.310342 -0.509720 -0.526646 -0.239056 -0.172753 0.134894 0.049404 -0.085979 -0.308627 -0.306055 0.491416 0.371986 0.033638 -0.169697 -0.208006 0.015235 -0.034984 -0.179257 -0.177075 -0.201324 0.486900 0.099103 0.039675 0.111854 0.104554 0.094979 0.096088 0.082910 0.099119 0.093215 0.082866 0.173687 0.175023 0.137855 0.131271 0.124755 0.153602 0.141869 0.140987 0.103809 0.091454 0.103507
qa: -0.1809 -0.1752 -0.1800 -0.3103 -0.5097 -0.5266 -0.2391 -0.1728 0.1349 0.0494 -0.0860 -0.3086 -0.3061 0.4914 0.3720 0.0336 -0.1697 -0.2080 0.0152 -0.0350 -0.1793 -0.1771 -0.2013 0.4869 0.0991 0.0397 0.1119 0.1046 0.0950 0.0961 0.0829 0.0991 0.0932 0.0829 0.1737 0.1750 0.1379 0.1313 0.1248 0.1536 0.1419 0.1410 0.1038 0.0915 0.1035
va: 1.1243 1.1182 1.1222 2.0692 1.9966 1.9775 3.2146 3.2015 3.8111 3.8799 3.8767 3.9419 3.9314 4.3392 4.1878 3.4525 4.0256 3.9674 3.7358 3.8698 3.9518 3.9433 3.8980 4.4502 1.0382 1.0163 1.0101 1.0303 1.0045 1.0045 1.0048 1.0042 1.0043 1.0089 1.0248 1.0068 1.0253 1.0337 1.0084 1.0062 1.0006 1.0024 0.9962 1.0061 0.9957
dispcorr: -0.024100406 hartree
energy: -1257.344048941765
dipole: 24.43426 -23.78572 0.64854 21.00489 -20.12940 0.87550 6.81883 -5.30707 1.51176
magnitude: 1.86347 au
magnitude: 4.73656 debye
