program: Gaussian 09
title: 000005876
version: EM64L-G09RevD.01
frameworkgroup: C1[X(C21H27FO5)]
method: RPBEPBE
basis: SDD
operation: Freq
keyword: #p
keyword: freq=noraman
keyword: PBEPBE/SDD
title: #p freq=noraman PBEPBE/SDD
converged: YES YES NO NO
title: Mulliken charges:
elementType: F O O O O O C C C C C C C C C C C C C C C C C C C C C H H H H H H H H H H H H H H H H H H H H H H H H H H H
charge: -0.218168 -0.460615 -0.440832 -0.261739 -0.438241 -0.236797 0.343267 -0.101541 -0.184435 -0.132349 0.147846 -0.570402 -0.201446 -0.562269 0.146841 -0.509107 -0.521331 -0.830168 -0.151572 0.372258 0.051210 -0.789947 -0.187287 -0.575633 -0.376575 -0.402527 0.186969 0.273795 0.254419 0.239864 0.233247 0.247598 0.221100 0.227572 0.237383 0.228802 0.253756 0.245496 0.243180 0.278552 0.208757 0.229614 0.224860 0.201338 0.254919 0.245505 0.231660 0.363734 0.340768 0.299960 0.225798 0.264468 0.258182 0.370266
chargesum: 0.00000
title: Mulliken charges with hydrogens summed into heavy atoms:
elementType: F O O O O O C C C C C C C C C C C C C C C C C C C C C
charge: -0.218168 -0.096881 -0.100064 -0.261739 -0.067975 -0.236797 0.343267 0.172254 0.069983 0.107515 0.147846 -0.089557 0.019654 -0.097314 0.146841 -0.026549 -0.032655 -0.113245 0.073288 0.372258 0.051210 -0.088185 0.044374 -0.275673 0.113691 -0.144346 0.186969
polarizability: 3.09617951e+02 -2.77673807e+00 2.12860317e+02 -3.12188690e+01 7.74982404e+00 1.92747244e+02
1716.lowfreq: -11.8038 -7.9766 -0.0005 0.0002 0.0006 5.8951 25.5170 31.3339 47.3500
frequency: 25.4399 31.3295 47.2424 57.5520 67.1308 91.1203 130.2074 140.9751 149.3378 162.6030 174.6968 175.1990 198.5135 209.5768 212.4611 231.4105 238.5056 252.5956 257.1027 262.0750 279.4584 300.0758 311.0949 315.6631 337.8850 344.5499 350.6753 366.2956 381.9526 388.1802 398.5553 403.9709 430.9784 434.7773 444.2474 468.0402 478.0405 498.8949 500.1884 509.3845 528.4581 540.1910 578.9804 594.5182 631.0750 639.7388 667.8944 692.5783 706.4690 732.4409 753.5611 758.2226 792.2788 807.6588 817.4826 829.9211 856.6686 877.2739 882.1104 910.6094 918.0135 920.0025 932.9010 939.3394 945.0017 957.1038 969.1636 987.3784 992.3825 996.9061 1009.7047 1013.6628 1020.6828 1035.3906 1040.3597 1054.2587 1062.5025 1075.8024 1095.9508 1100.9085 1109.0444 1116.3115 1137.3380 1143.4781 1153.9291 1157.7813 1174.0173 1181.1365 1191.0087 1194.1796 1202.5706 1228.3168 1232.3756 1245.2030 1257.5090 1265.9558 1269.5386 1276.3885 1287.2409 1293.0524 1294.3742 1295.9256 1302.8517 1303.9983 1328.1666 1332.8497 1336.3333 1345.9237 1354.0114 1359.8927 1367.4787 1376.1927 1382.8340 1383.9724 1396.7672 1410.1608 1440.6044 1452.2140 1455.8626 1466.1902 1470.2984 1475.1067 1488.6274 1493.5102 1503.1642 1561.4047 1564.9025 1616.8621 1663.7304 2927.0333 2949.0313 2954.2325 2971.3128 2982.5349 2983.7926 2989.5803 2990.3732 2997.9246 2999.1728 3000.3031 3026.7335 3045.2584 3059.9588 3063.3063 3064.4281 3067.2901 3073.3857 3090.3855 3093.6964 3100.4649 3113.3886 3150.8634 3166.2112 3440.2692 3450.8526 3586.0593
redmass: 7.1622 5.6693 6.1980 8.0421 6.4212 3.9466 4.0622 4.3207 3.7801 3.5663 4.3021 3.1209 3.7738 4.8565 3.6324 3.5761 3.0787 1.4037 2.8086 2.1793 3.5373 3.1498 1.4706 2.1440 1.8630 3.4196 3.2191 3.5537 3.3815 5.8667 1.9047 2.1076 2.6178 4.5798 2.3291 3.1229 2.8420 3.8677 1.2304 3.9915 4.5747 3.2533 3.4867 2.7780 3.9713 3.7370 3.5476 3.3889 3.7012 3.7701 4.2693 3.9458 1.9987 2.9137 1.6972 2.4946 2.5433 2.8054 2.6469 2.1613 2.6891 2.3000 1.7734 2.1906 2.6993 2.2123 3.3560 2.2650 1.3436 2.0959 2.4404 4.0998 2.5230 2.2534 2.6790 2.7225 2.7301 3.0648 2.3018 2.2248 2.2382 2.0862 2.4040 1.9353 1.5433 2.1005 1.8303 1.3824 1.1654 1.6285 1.7061 1.3263 1.4139 1.4777 1.4024 1.4096 1.2602 1.5064 1.8590 1.3975 1.5647 1.3910 1.5108 1.4270 1.3604 1.5865 1.3964 1.6207 1.5229 1.6297 1.3464 1.3615 1.3833 1.7154 1.2832 1.1867 1.0743 1.0860 1.0797 1.0551 1.0934 1.0677 1.0809 1.0521 1.0530 9.2061 7.6531 8.7330 7.5700 1.0705 1.0814 1.0805 1.0812 1.0400 1.0753 1.0422 1.0715 1.0728 1.0646 1.0627 1.0621 1.0873 1.1017 1.1016 1.1012 1.0970 1.0988 1.0871 1.1031 1.1004 1.0960 1.0964 1.0920 1.0643 1.0646 1.0659
irintensity: 1.8098 2.4083 0.7533 2.7657 0.5330 1.5903 1.4730 1.6218 15.7115 3.2967 2.5383 0.4665 2.6553 8.1515 3.9063 7.8353 17.1122 88.6633 1.8963 4.7031 18.6414 0.5553 21.0063 3.3029 36.2056 12.9858 6.4731 22.5091 4.5923 20.1272 31.7715 26.7387 37.6216 16.4022 41.9597 3.2155 1.6639 5.5917 109.0203 7.5367 8.8759 2.7493 11.2346 27.3766 7.8195 4.4272 2.4336 7.4530 12.2143 1.3854 4.2916 1.2636 6.2581 1.8639 23.7630 3.0320 14.6319 1.3926 13.0901 17.2348 10.3690 68.5118 29.1377 12.1740 55.4897 2.5112 28.7517 13.7442 2.4630 22.5352 6.3271 153.0239 17.2131 2.7951 13.0110 43.3120 12.7266 15.8792 5.9913 9.0212 0.5169 23.0645 3.4898 8.5260 15.2763 0.7109 6.4724 2.7680 5.9333 65.1626 23.0492 9.6693 1.8266 6.7175 151.6191 1.1930 5.7614 7.9195 17.9653 31.8410 14.0132 12.5745 5.9129 5.4945 2.6405 4.6306 2.8234 38.5970 6.6415 4.9990 6.8290 2.5662 57.4196 15.9020 13.9147 29.3450 13.8151 2.0612 5.7783 6.3572 6.4954 25.8392 0.6961 13.9412 9.4109 192.2828 68.0032 6.5169 132.3554 34.6788 6.2003 5.5698 28.0031 19.1182 17.9072 35.0567 5.1056 36.5963 22.6761 37.4995 31.9290 14.1793 7.2223 27.8383 17.4668 29.5742 25.5362 22.2016 19.5128 18.9304 10.5161 11.4474 0.1400 15.8072 41.9595 2.2721
temp: 298.150 k
press: 1.00000 atm
elementType: 9 8 8 8 8 8 6 6 6 6 6 6 6 6 6 6 6 6 6 6 6 6 6 6 6 6 6 1 1 1 1 1 1 1 1 1 1 1 1 1 1 1 1 1 1 1 1 1 1 1 1 1 1 1
symmnumber: 1
zpe: 1162781.9 jmol-1
zpe.correction: 0.442880 hartree
zpe.thermalcorrener: 0.468432 hartree
zpe.thermalcorrenthalpy: 0.469376 hartree
zpe.thermalcorrgfe: 0.389245 hartree
zpe.sumelectzpe: -1290.296662 hartree
zpe.sumelectthermal: -1290.271110 hartree
zpe.sumelectthermalent: -1290.270166 hartree
zpe.sumelectthermalfe: -1290.350297 hartree
dipole: -2.6899 -0.3066 3.6170
dipole: 4.5180
quadrupole: -220.5451 -156.0934 -166.2856
quadrupole: -16.9016 21.3719 1.1466
quadrupole: -39.5704 24.8813 14.6891 -16.9016 21.3719 1.1466
hfenergy: -1290.7395425 hartree
pointgroup: C01 [X(C21H27F1O5)]
dipole: -1.0869465 0.1982411 -1.392431 debye
polarizability: 310.9979359|0.0628695|212.1406811|28.7902556|8.0789972|192.0868956 unknown
InChI: InChI=1S/C21H27FO5/c1-19-5-3-11(24)7-14(19)15(22)8-12-13-4-6-21(27,17(26)10-23)20(13,2)9-16(25)18(12)19/h3,5,7,12-13,15-16,18,23,25,27H,4,6,8-10H2,1-2H3
charge 0 multiplicity 1
54 atoms
F  3.497497 -3.0149 -0.560843
O  -2.790302 -0.324436 2.314251
O  -0.217545 2.07393 -1.601682
O  -4.691495 1.357042 1.474761
O  -6.617028 0.957287 -0.339888
O  5.976232 0.572894 1.839285
C  -2.007467 0.103298 -0.039327
C  -0.994559 -1.061455 0.182815
C  0.333897 -0.87065 -0.581164
C  0.989555 0.450612 -0.060947
C  -3.185616 -0.443684 0.898999
C  -1.36005 1.419569 0.442769
C  0.029848 1.675101 -0.194303
C  -1.834104 -2.341444 -0.035453
C  2.47281 0.680494 -0.617647
C  -3.23331 -1.968427 0.564638
C  1.254102 -2.094556 -0.344088
C  -2.496363 0.211564 -1.507511
C  2.666946 -1.85411 -0.892827
C  3.261028 -0.596132 -0.301718
C  -4.486058 0.346925 0.730664
C  2.540404 0.921155 -2.172501
C  3.08898 1.894432 0.055781
C  4.379286 -0.620899 0.481352
C  -5.583882 -0.04937 -0.250852
C  4.205102 1.864301 0.836151
C  4.932525 0.599054 1.108427
H  -0.742435 -1.034325 1.265138
H  0.13025 -0.777018 -1.667378
H  1.126834 0.317825 1.036017
H  -1.222876 1.366431 1.539766
H  -1.995991 2.295655 0.21936
H  0.481883 2.533276 0.345223
H  -1.400695 -3.219873 0.471759
H  -1.915222 -2.586816 -1.111068
H  -4.046094 -2.213534 -0.14039
H  -3.433249 -2.507429 1.505461
H  0.828058 -2.995702 -0.82022
H  1.338596 -2.294973 0.742334
H  -1.650568 0.4109 -2.181106
H  -3.011014 -0.705315 -1.84712
H  -3.187112 1.065895 -1.628361
H  2.656884 -1.811313 -2.00029
H  2.36175 1.981447 -2.429702
H  3.553364 0.680473 -2.540235
H  1.807298 0.308987 -2.72316
H  2.600747 2.858845 -0.14494
H  -3.152285 0.546257 2.641366
H  0.575295 2.547369 -1.953827
H  4.904151 -1.561782 0.673785
H  -6.007524 -1.012576 0.116748
H  -5.174028 -0.23329 -1.25952
H  4.619956 2.772802 1.288001
H  -6.477907 1.58999 0.420612
