program: Orca
programVersion: 5.0.2
elementType: F F F O O O N N C C C C C C C C C C C C C C C C H H H H H H H H H H H H H H H H H H H H H
charge: 0
multiplicity: 1
keywords: wb97x-d3
keywords: def2-TZVPP
keywords: def2/J RIJCOSX
keywords: DEFGRID2
keywords: scfconv7
keywords: smallprint printgap noloewdin
keywords: NOSOSCF
formula: C16H21F3N2O3
InChI: InChI=1/C16H21F3N2O3/c1-10(2)13(21-15(23)24-9-16(17,18)19)8-20-14(22)12-6-4-11(3)5-7-12/h4-7,10,13,20-21H,8-9H2,1-3H3
45 atoms
F  -2.169788 -1.324411 -1.136057
F  -1.321925 -3.22179 -1.687993
F  -2.77941 -3.117965 -0.105381
O  0.421551 -1.652474 -0.263272
O  1.309684 -1.144026 1.74057
O  0.595501 1.818497 -1.687599
N  2.322896 -0.520518 -0.20536
N  1.306967 1.980215 0.448747
C  3.251287 0.437383 0.359432
C  4.650858 0.250631 -0.237913
C  2.71421 1.870224 0.153669
C  5.177264 -1.153196 0.038594
C  5.628418 1.291738 0.299081
C  1.356505 -1.093283 0.528506
C  0.348167 1.85559 -0.486884
C  -1.059692 1.7641 0.000231
C  -2.084742 2.119704 -0.87383
C  -1.399414 1.265178 1.256045
C  -3.756809 1.484321 0.754905
C  -0.649215 -2.302696 0.388038
C  -3.410061 1.992553 -0.49589
C  -2.728692 1.125706 1.622673
C  -5.190828 1.289533 1.139574
C  -1.731112 -2.489107 -0.648216
H  3.309739 0.239315 1.432205
H  4.571643 0.385917 -1.323971
H  3.253763 2.562024 0.799179
H  2.885312 2.18948 -0.875263
H  6.171986 -1.283766 -0.390625
H  5.256345 -1.337636 1.113067
H  4.536406 -1.927018 -0.384118
H  6.63333 1.098499 -0.079452
H  5.369449 2.309092 0.004782
H  5.679763 1.261727 1.390472
H  2.194256 -0.496133 -1.208199
H  1.045614 2.04965 1.418465
H  -1.847618 2.503818 -1.857601
H  -0.639355 0.945964 1.957735
H  -1.053868 -1.711121 1.212066
H  -0.349016 -3.279543 0.777405
H  -4.189689 2.285934 -1.188946
H  -2.967014 0.722271 2.599707
H  -5.528912 0.286154 0.871194
H  -5.339001 1.402165 2.213358
H  -5.844629 1.996379 0.63007
elementType: F O N C H
totalener: -1257.31893652 hartree
nucrepener: 2284.91588537 hartree
electener: -3542.23482188 hartree
oneelecener: -6265.76874205 hartree
twoeener: 2723.53392017 hartree
cpcmener: -0.03721715 hartree
kineticenergy: 1252.18691695 hartree
xcener: -115.096073257912 hartree
chargesum: 0.0000000
charge: -0.172192 -0.179755 -0.182604 -0.308909 -0.506829 -0.527564 -0.218636 -0.176997 0.116978 0.030366 -0.086666 -0.291437 -0.306926 0.482764 0.391278 0.014136 -0.170710 -0.212701 0.010522 -0.047453 -0.168939 -0.175729 -0.200121 0.490931 0.093329 0.047996 0.118040 0.107187 0.095303 0.084784 0.091102 0.093087 0.094111 0.090643 0.169714 0.177329 0.136835 0.131371 0.128686 0.157767 0.140658 0.141069 0.104778 0.096874 0.096529
qa: -0.1722 -0.1798 -0.1826 -0.3089 -0.5068 -0.5276 -0.2186 -0.1770 0.1170 0.0304 -0.0867 -0.2914 -0.3069 0.4828 0.3913 0.0141 -0.1707 -0.2127 0.0105 -0.0475 -0.1689 -0.1757 -0.2001 0.4909 0.0933 0.0480 0.1180 0.1072 0.0953 0.0848 0.0911 0.0931 0.0941 0.0906 0.1697 0.1773 0.1368 0.1314 0.1287 0.1578 0.1407 0.1411 0.1048 0.0969 0.0965
va: 1.1190 1.1233 1.1220 2.0709 2.0023 1.9769 3.1845 3.2056 3.7886 3.8835 3.8546 3.9242 3.9482 4.3459 4.1755 3.4512 4.0287 3.9532 3.7362 3.8756 3.9450 3.9395 3.8960 4.4412 1.0401 1.0196 1.0039 1.0286 1.0055 1.0026 1.0140 1.0051 1.0024 1.0007 1.0280 1.0058 1.0268 1.0336 1.0048 1.0071 1.0011 1.0019 0.9945 1.0019 1.0024
dispcorr: -0.024669609 hartree
energy: -1257.343606125507
dipole: 27.30426 -26.65821 0.64605 19.12657 -18.63192 0.49465 11.30020 -9.77108 1.52912
magnitude: 1.73213 au
magnitude: 4.40272 debye
