program: Orca
programVersion: 5.0.2
elementType: F F F O O O N N C C C C C C C C C C C C C C C C H H H H H H H H H H H H H H H H H H H H H
charge: 0
multiplicity: 1
keywords: wb97x-d3
keywords: def2-TZVPP
keywords: def2/J RIJCOSX
keywords: DEFGRID2
keywords: scfconv7
keywords: smallprint printgap noloewdin
keywords: NOSOSCF
formula: C16H21F3N2O3
InChI: InChI=1/C16H21F3N2O3/c1-10(2)13(21-15(23)24-9-16(17,18)19)8-20-14(22)12-6-4-11(3)5-7-12/h4-7,10,13,20-21H,8-9H2,1-3H3
45 atoms
F  -0.795325 -3.851719 -1.04228
F  -0.129742 -3.684931 0.992369
F  -2.241408 -3.748744 0.556576
O  0.115998 -1.277962 -0.444791
O  0.742229 -0.704338 1.649044
O  0.59287 1.964743 -1.943754
N  2.088332 -0.323209 -0.152632
N  1.173069 2.319931 0.208835
C  2.971276 0.643778 0.469865
C  4.448338 0.335831 0.194446
C  2.583391 2.06956 0.040409
C  4.782348 0.220963 -1.290079
C  4.885761 -0.919278 0.939992
C  0.973739 -0.755407 0.460757
C  0.271229 2.145306 -0.7739
C  -1.168534 2.185937 -0.381631
C  -1.619457 1.87861 0.900776
C  -2.111342 2.476797 -1.36584
C  -3.9210 2.166524 0.209044
C  -1.123863 -1.765778 0.0151
C  -2.975596 1.870254 1.187186
C  -3.463307 2.476279 -1.070969
C  -5.386636 2.115322 0.512559
C  -1.066156 -3.271536 0.132012
H  2.816166 0.568621 1.547561
H  5.011254 1.18344 0.60103
H  3.143696 2.785521 0.642936
H  2.849532 2.250171 -1.000069
H  4.475585 1.096425 -1.864598
H  5.859637 0.113956 -1.42595
H  4.317831 -0.657051 -1.745629
H  4.343488 -1.800475 0.591102
H  5.949779 -1.110858 0.7911
H  4.716268 -0.829468 2.014838
H  2.092194 -0.358352 -1.163107
H  0.85222 2.511174 1.144159
H  -0.930037 1.611167 1.691527
H  -1.786858 2.711338 -2.371444
H  -1.876769 -1.494269 -0.726157
H  -1.418615 -1.336136 0.973012
H  -3.301578 1.620375 2.189846
H  -4.176574 2.716556 -1.850598
H  -5.949634 2.82189 -0.096862
H  -5.789168 1.120788 0.30631
H  -5.589465 2.333827 1.560761
elementType: F O N C H
totalener: -1257.31915965 hartree
nucrepener: 2251.29369938 hartree
electener: -3508.61285902 hartree
oneelecener: -6198.29183591 hartree
twoeener: 2689.67897689 hartree
cpcmener: -0.03665941 hartree
kineticenergy: 1252.19275481 hartree
xcener: -115.097009514377 hartree
chargesum: -0.0000000
charge: -0.182842 -0.179444 -0.181470 -0.315425 -0.495305 -0.526579 -0.242322 -0.173279 0.155381 0.043236 -0.098504 -0.311672 -0.303409 0.465173 0.387423 0.013459 -0.206573 -0.163036 0.008461 -0.009561 -0.168429 -0.172877 -0.202499 0.498775 0.096598 0.040268 0.112026 0.107036 0.098335 0.096982 0.081815 0.083965 0.096941 0.091258 0.173264 0.177722 0.127425 0.139308 0.139160 0.116452 0.141583 0.141737 0.097223 0.105767 0.096455
qa: -0.1828 -0.1794 -0.1815 -0.3154 -0.4953 -0.5266 -0.2423 -0.1733 0.1554 0.0432 -0.0985 -0.3117 -0.3034 0.4652 0.3874 0.0135 -0.2066 -0.1630 0.0085 -0.0096 -0.1684 -0.1729 -0.2025 0.4988 0.0966 0.0403 0.1120 0.1070 0.0983 0.0970 0.0818 0.0840 0.0969 0.0913 0.1733 0.1777 0.1274 0.1393 0.1392 0.1165 0.1416 0.1417 0.0972 0.1058 0.0965
va: 1.1184 1.1201 1.1244 2.0712 2.0118 1.9794 3.1990 3.2065 3.7909 3.8830 3.8907 3.9414 3.9301 4.3905 4.1759 3.4431 3.9694 4.0221 3.7400 3.8586 3.9394 3.9481 3.8991 4.4475 1.0352 1.0155 1.0112 1.0264 1.0048 1.0045 1.0044 1.0093 1.0040 1.0044 1.0249 1.0056 1.0339 1.0263 1.0037 1.0281 1.0012 1.0010 1.0016 0.9937 1.0023
dispcorr: -0.023966146 hartree
energy: -1257.343125791669
dipole: 17.54776 -17.60468 -0.05692 27.32358 -25.74900 1.57458 1.09210 -0.23273 0.85937
magnitude: 1.79473 au
magnitude: 4.56184 debye
