program: Orca
programVersion: 5.0.2
elementType: F F F O O O N N C C C C C C C C C C C C C C C C H H H H H H H H H H H H H H H H H H H H H
charge: 0
multiplicity: 1
keywords: wb97x-d3
keywords: def2-TZVPP
keywords: def2/J RIJCOSX
keywords: DEFGRID2
keywords: scfconv7
keywords: smallprint printgap noloewdin
keywords: NOSOSCF
formula: C16H21F3N2O3
InChI: InChI=1/C16H21F3N2O3/c1-10(2)13(21-15(23)24-9-16(17,18)19)8-20-14(22)12-6-4-11(3)5-7-12/h4-7,10,13,20-21H,8-9H2,1-3H3
45 atoms
F  -0.710992 -3.936342 -0.98954
F  -0.095733 -3.68563 1.052459
F  -2.195473 -3.808554 0.572429
O  0.133397 -1.323197 -0.460453
O  0.722048 -0.712975 1.63417
O  0.568153 1.96394 -1.952375
N  2.081063 -0.327717 -0.155527
N  1.142244 2.309559 0.204538
C  2.952391 0.645079 0.471186
C  4.433569 0.348125 0.202614
C  2.554626 2.068015 0.040685
C  4.775729 0.237703 -1.280544
C  4.876323 -0.905084 0.948574
C  0.968369 -0.773083 0.449489
C  0.243981 2.144206 -0.783504
C  -1.196429 2.203602 -0.39452
C  -1.656664 1.856783 0.873467
C  -2.13026 2.554149 -1.36866
C  -3.949005 2.23354 0.19401
C  -1.105813 -1.822151 -0.012207
C  -3.014004 1.870117 1.158237
C  -3.481407 2.577652 -1.074394
C  -5.413607 2.268878 0.505987
C  -1.020513 -3.322021 0.158062
H  2.792817 0.568513 1.548281
H  4.988342 1.199148 0.613101
H  3.107559 2.787921 0.645106
H  2.821685 2.249759 -0.999169
H  5.854974 0.144678 -1.410274
H  4.324992 -0.645989 -1.738241
H  4.460776 1.109437 -1.856025
H  4.704935 -0.815933 2.023091
H  4.338681 -1.788602 0.59847
H  5.941543 -1.090825 0.800509
H  2.098416 -0.373281 -1.165256
H  0.815611 2.496549 1.138959
H  -0.974142 1.538311 1.651193
H  -1.79901 2.813947 -2.365743
H  -1.844764 -1.593011 -0.780837
H  -1.432292 -1.365274 0.922795
H  -3.348206 1.582518 2.147826
H  -4.187576 2.860117 -1.846381
H  -5.752619 3.294036 0.670757
H  -6.007366 1.865018 -0.314523
H  -5.647671 1.69928 1.404654
elementType: F O N C H
totalener: -1257.31938039 hartree
nucrepener: 2245.84497904 hartree
electener: -3503.16435944 hartree
oneelecener: -6187.41610969 hartree
twoeener: 2684.25175025 hartree
cpcmener: -0.03671077 hartree
kineticenergy: 1252.19643595 hartree
xcener: -115.097483959749 hartree
chargesum: 0.0000000
charge: -0.183169 -0.179059 -0.181340 -0.316316 -0.496569 -0.526965 -0.241126 -0.173250 0.152972 0.042841 -0.095701 -0.311640 -0.303297 0.468948 0.390750 0.019276 -0.214844 -0.167559 0.010020 -0.008087 -0.168509 -0.175572 -0.201996 0.497592 0.096452 0.040271 0.112081 0.106330 0.097020 0.081739 0.098577 0.091287 0.083903 0.096859 0.172971 0.177832 0.130512 0.139276 0.140626 0.114615 0.141382 0.141708 0.105479 0.099923 0.093757
qa: -0.1832 -0.1791 -0.1813 -0.3163 -0.4966 -0.5270 -0.2411 -0.1733 0.1530 0.0428 -0.0957 -0.3116 -0.3033 0.4689 0.3908 0.0193 -0.2148 -0.1676 0.0100 -0.0081 -0.1685 -0.1756 -0.2020 0.4976 0.0965 0.0403 0.1121 0.1063 0.0970 0.0817 0.0986 0.0913 0.0839 0.0969 0.1730 0.1778 0.1305 0.1393 0.1406 0.1146 0.1414 0.1417 0.1055 0.0999 0.0938
va: 1.1181 1.1204 1.1245 2.0704 2.0104 1.9785 3.2017 3.2021 3.7962 3.8832 3.8871 3.9414 3.9304 4.3840 4.1703 3.4484 3.9750 4.0252 3.7396 3.8600 3.9427 3.9479 3.8994 4.4443 1.0349 1.0155 1.0113 1.0271 1.0046 1.0043 1.0048 1.0044 1.0093 1.0040 1.0248 1.0052 1.0341 1.0256 1.0039 1.0282 1.0017 1.0009 0.9941 0.9992 1.0042
dispcorr: -0.023784496 hartree
energy: -1257.343164889538
dipole: 17.11961 -17.17329 -0.05369 28.06381 -26.44012 1.62369 0.83383 -0.00658 0.82725
magnitude: 1.82307 au
magnitude: 4.63389 debye
