program: Orca
programVersion: 5.0.2
elementType: F F F O O O N N C C C C C C C C C C C C C C C C H H H H H H H H H H H H H H H H H H H H H
charge: 0
multiplicity: 1
keywords: wb97x-d3
keywords: def2-TZVPP
keywords: def2/J RIJCOSX
keywords: DEFGRID2
keywords: scfconv7
keywords: smallprint printgap noloewdin
keywords: NOSOSCF
formula: C16H21F3N2O3
InChI: InChI=1/C16H21F3N2O3/c1-10(2)13(21-15(23)24-9-16(17,18)19)8-20-14(22)12-6-4-11(3)5-7-12/h4-7,10,13,20-21H,8-9H2,1-3H3
45 atoms
F  -0.132981 -3.753603 0.832553
F  -2.237512 -3.814616 0.359036
F  -0.763796 -3.86987 -1.217845
O  0.125055 -1.302883 -0.52303
O  0.694533 -0.803016 1.605326
O  0.604762 2.051228 -1.853203
N  2.076445 -0.337977 -0.147343
N  1.156327 2.288633 0.324179
C  2.947182 0.596288 0.536407
C  4.429754 0.298692 0.2750
C  2.568252 2.041147 0.166223
C  4.791427 0.250593 -1.207005
C  4.85286 -0.989791 0.970475
C  0.953966 -0.805116 0.42207
C  0.268588 2.180835 -0.681107
C  -1.175059 2.239377 -0.304521
C  -2.093885 2.656326 -1.264621
C  -1.651893 1.828109 0.939417
C  -3.931698 2.276585 0.262339
C  -1.122339 -1.813754 -0.11306
C  -3.448596 2.683654 -0.979779
C  -3.009798 1.845151 1.213199
C  -5.39568 2.316445 0.576784
C  -1.056846 -3.322163 -0.03297
H  2.770726 0.471738 1.606378
H  4.985708 1.125901 0.73011
H  3.120443 2.727613 0.808948
H  2.849316 2.266779 -0.861387
H  5.871301 0.150989 -1.326097
H  4.337536 -0.606815 -1.709308
H  4.493851 1.150574 -1.747104
H  4.314696 -1.852788 0.57341
H  5.918864 -1.176326 0.829818
H  4.666085 -0.947422 2.045247
H  2.106267 -0.335435 -1.157823
H  0.820694 2.441083 1.261375
H  -1.750315 2.96599 -2.243145
H  -0.979957 1.456147 1.702541
H  -1.854331 -1.532247 -0.870951
H  -1.449774 -1.410502 0.845781
H  -4.143702 3.019003 -1.740266
H  -3.357182 1.506805 2.182136
H  -5.694595 1.473882 1.200534
H  -5.651342 3.226842 1.123845
H  -6.002574 2.300328 -0.327874
elementType: F O N C H
totalener: -1257.31952226 hartree
nucrepener: 2244.44154428 hartree
electener: -3501.76106654 hartree
oneelecener: -6184.59866346 hartree
twoeener: 2682.83759692 hartree
cpcmener: -0.03676220 hartree
kineticenergy: 1252.19497108 hartree
xcener: -115.097223901664 hartree
chargesum: 0.0000000
charge: -0.179334 -0.181563 -0.182870 -0.316453 -0.496574 -0.527044 -0.241398 -0.172235 0.154907 0.042952 -0.095796 -0.312275 -0.303083 0.469273 0.390258 0.018747 -0.166861 -0.217360 0.009339 -0.007495 -0.172181 -0.169943 -0.201968 0.497916 0.095830 0.040084 0.111887 0.105962 0.096931 0.081931 0.098828 0.083626 0.096867 0.091380 0.173014 0.177415 0.138822 0.132274 0.140189 0.114340 0.141804 0.141068 0.098547 0.105259 0.094984
qa: -0.1793 -0.1816 -0.1829 -0.3165 -0.4966 -0.5270 -0.2414 -0.1722 0.1549 0.0430 -0.0958 -0.3123 -0.3031 0.4693 0.3903 0.0187 -0.1669 -0.2174 0.0093 -0.0075 -0.1722 -0.1699 -0.2020 0.4979 0.0958 0.0401 0.1119 0.1060 0.0969 0.0819 0.0988 0.0836 0.0969 0.0914 0.1730 0.1774 0.1388 0.1323 0.1402 0.1143 0.1418 0.1411 0.0985 0.1053 0.0950
va: 1.1202 1.1240 1.1184 2.0707 2.0106 1.9782 3.2014 3.2012 3.7946 3.8829 3.8863 3.9412 3.9307 4.3829 4.1698 3.4484 4.0291 3.9735 3.7407 3.8589 3.9451 3.9465 3.8999 4.4440 1.0354 1.0155 1.0114 1.0273 1.0046 1.0044 1.0047 1.0093 1.0040 1.0043 1.0247 1.0053 1.0257 1.0335 1.0038 1.0285 1.0012 1.0016 1.0001 0.9940 1.0035
dispcorr: -0.023749779 hartree
energy: -1257.343272036980
dipole: 17.40784 -17.44513 -0.03728 27.92708 -26.33434 1.59274 2.66364 -1.72232 0.94132
magnitude: 1.85048 au
magnitude: 4.70355 debye
