program: Orca
programVersion: 5.0.2
elementType: F F F O O O N N C C C C C C C C C C C C C C C C H H H H H H H H H H H H H H H H H H H H H
charge: 0
multiplicity: 1
keywords: wb97x-d3
keywords: def2-TZVPP
keywords: def2/J RIJCOSX
keywords: DEFGRID2
keywords: scfconv7
keywords: smallprint printgap noloewdin
keywords: NOSOSCF
formula: C16H21F3N2O3
InChI: InChI=1/C16H21F3N2O3/c1-10(2)13(21-15(23)24-9-16(17,18)19)8-20-14(22)12-6-4-11(3)5-7-12/h4-7,10,13,20-21H,8-9H2,1-3H3
45 atoms
F  -1.488881 -1.904901 -0.634991
F  -1.00995 -3.679472 -1.744812
F  -2.393354 -3.788599 -0.094724
O  1.030393 -2.83467 0.017649
O  0.764323 -1.227514 1.586825
O  0.85675 3.592447 0.200845
N  2.301411 -1.035776 -0.084491
N  0.830763 1.471697 -0.589356
C  2.821186 0.28131 0.242578
C  4.356972 0.261636 0.309583
C  2.258391 1.313147 -0.739759
C  4.895772 1.544989 0.933087
C  5.028216 -0.005348 -1.034301
C  1.319052 -1.641682 0.591208
C  0.246469 2.563832 -0.066761
C  -1.225387 2.464232 0.159136
C  -2.017772 3.589805 -0.045801
C  -1.824901 1.296306 0.625207
C  -3.992791 2.370467 0.64161
C  -0.127461 -3.51289 0.447675
C  -3.384059 3.53583 0.179436
C  -3.188376 1.255126 0.866181
C  -5.463957 2.318813 0.922265
C  -1.259602 -3.219131 -0.513972
H  2.45465 0.530949 1.239767
H  4.612182 -0.561986 0.98443
H  2.727995 2.28193 -0.583346
H  2.476329 1.013624 -1.767564
H  5.96631 1.456072 1.12337
H  4.757192 2.411295 0.283901
H  4.41126 1.764162 1.886426
H  4.684694 -0.92845 -1.505818
H  4.865285 0.810213 -1.741576
H  6.106857 -0.104457 -0.902454
H  2.626327 -1.473784 -0.934726
H  0.244391 0.699463 -0.86388
H  -1.571094 4.51164 -0.396537
H  -1.22776 0.420472 0.842756
H  -0.425261 -3.237366 1.460505
H  0.088116 -4.581905 0.433665
H  -3.986888 4.417306 -0.003934
H  -3.632238 0.340092 1.240786
H  -5.907192 1.387514 0.568604
H  -5.658305 2.376365 1.995466
H  -5.993936 3.145359 0.450292
elementType: F O N C H
totalener: -1257.31753543 hartree
nucrepener: 2201.32411457 hartree
electener: -3458.64165000 hartree
oneelecener: -6097.87672025 hartree
twoeener: 2639.23507025 hartree
cpcmener: -0.04018177 hartree
kineticenergy: 1252.18053851 hartree
xcener: -115.092446679804 hartree
chargesum: 0.0000000
charge: -0.177749 -0.181771 -0.179798 -0.322264 -0.505780 -0.535335 -0.228886 -0.189875 0.135751 0.032809 -0.104858 -0.303135 -0.299012 0.487050 0.410944 -0.009676 -0.167437 -0.176513 0.014333 -0.014631 -0.180018 -0.191400 -0.201947 0.488054 0.098594 0.045105 0.099215 0.131475 0.096119 0.084803 0.098868 0.088421 0.087186 0.099015 0.171756 0.174048 0.139254 0.150763 0.121054 0.140720 0.141266 0.136719 0.099153 0.104881 0.092730
qa: -0.1777 -0.1818 -0.1798 -0.3223 -0.5058 -0.5353 -0.2289 -0.1899 0.1358 0.0328 -0.1049 -0.3031 -0.2990 0.4870 0.4109 -0.0097 -0.1674 -0.1765 0.0143 -0.0146 -0.1800 -0.1914 -0.2019 0.4881 0.0986 0.0451 0.0992 0.1315 0.0961 0.0848 0.0989 0.0884 0.0872 0.0990 0.1718 0.1740 0.1393 0.1508 0.1211 0.1407 0.1413 0.1367 0.0992 0.1049 0.0927
va: 1.1123 1.1188 1.1257 2.0741 2.0010 1.9778 3.2033 3.2034 3.7794 3.9000 3.8852 3.9413 3.9427 4.3352 4.1312 3.5843 4.0130 3.9601 3.7362 3.8931 3.9389 3.9897 3.9000 4.3905 1.0400 1.0189 1.0399 0.9941 1.0041 1.0015 1.0032 1.0076 0.9997 1.0034 1.0228 1.0094 1.0203 1.0231 1.0275 1.0045 1.0013 1.0056 0.9989 0.9941 1.0046
dispcorr: -0.022010665 hartree
energy: -1257.339546097570
dipole: 21.49166 -20.86262 0.62904 23.81297 -26.06648 -2.25351 4.98241 -5.97349 -0.99108
magnitude: 2.54091 au
magnitude: 6.45848 debye
