program: Orca
programVersion: 5.0.2
elementType: F F F O O O N N C C C C C C C C C C C C C C C C H H H H H H H H H H H H H H H H H H H H H
charge: 0
multiplicity: 1
keywords: wb97x-d3
keywords: def2-TZVPP
keywords: def2/J RIJCOSX
keywords: DEFGRID2
keywords: scfconv7
keywords: smallprint printgap noloewdin
keywords: NOSOSCF
formula: C16H21F3N2O3
InChI: InChI=1/C16H21F3N2O3/c1-10(2)13(21-15(23)24-9-16(17,18)19)8-20-14(22)12-6-4-11(3)5-7-12/h4-7,10,13,20-21H,8-9H2,1-3H3
45 atoms
F  -2.20486 -3.897997 0.173823
F  -0.942866 -3.662559 -1.558745
F  -0.059086 -3.786324 0.395025
O  -0.037705 -1.192632 -0.607827
O  0.760623 -0.94993 1.492659
O  0.603564 2.134695 -1.756808
N  1.993602 -0.373455 -0.334533
N  1.238249 2.196115 0.407956
C  2.984831 0.435198 0.344949
C  4.39325 0.101147 -0.161774
C  2.63717 1.928743 0.17524
C  4.719264 -1.370852 0.062952
C  5.445487 0.980624 0.506756
C  0.904596 -0.839374 0.29407
C  0.310819 2.181809 -0.566938
C  -1.11979 2.228553 -0.138502
C  -2.068493 2.675552 -1.058552
C  -1.561264 1.777119 1.102807
C  -3.860976 2.242458 0.507493
C  -1.219555 -1.794826 -0.134633
C  -3.412424 2.690402 -0.735671
C  -2.912847 1.784942 1.416662
C  -5.321684 2.250033 0.839452
C  -1.102849 -3.294676 -0.282377
H  2.933869 0.184948 1.40722
H  4.417148 0.301718 -1.240419
H  3.216322 2.524091 0.879513
H  2.902087 2.264644 -0.827846
H  5.718314 -1.60342 -0.309073
H  4.698633 -1.6205 1.126642
H  4.018851 -2.032385 -0.446751
H  6.44605 0.678797 0.194066
H  5.338585 2.035284 0.251808
H  5.401854 0.891904 1.594967
H  1.945229 -0.281842 -1.34016
H  0.943938 2.29007 1.366828
H  -1.753945 3.018273 -2.035477
H  -0.870188 1.383583 1.837617
H  -2.042045 -1.433509 -0.752996
H  -1.435283 -1.542802 0.90455
H  -4.128921 3.049288 -1.465267
H  -3.231679 1.418777 2.384963
H  -5.733918 3.259263 0.785018
H  -5.88957 1.637048 0.137342
H  -5.509104 1.867648 1.842073
elementType: F O N C H
totalener: -1257.31901839 hartree
nucrepener: 2246.63743856 hartree
electener: -3503.95645694 hartree
oneelecener: -6189.01386080 hartree
twoeener: 2685.05740385 hartree
cpcmener: -0.03643291 hartree
kineticenergy: 1252.19842347 hartree
xcener: -115.097761600323 hartree
chargesum: 0.0000000
charge: -0.180473 -0.182787 -0.179663 -0.317003 -0.498171 -0.525903 -0.215057 -0.171159 0.118909 0.032055 -0.087296 -0.289929 -0.307080 0.462993 0.388582 0.004120 -0.159654 -0.202817 0.011648 -0.009915 -0.183353 -0.168958 -0.202642 0.498853 0.091849 0.046782 0.117239 0.106755 0.095043 0.084354 0.090896 0.092402 0.094358 0.090649 0.169692 0.177234 0.138771 0.129273 0.138905 0.117146 0.142562 0.141366 0.103763 0.103677 0.091982
qa: -0.1805 -0.1828 -0.1797 -0.3170 -0.4982 -0.5259 -0.2151 -0.1712 0.1189 0.0321 -0.0873 -0.2899 -0.3071 0.4630 0.3886 0.0041 -0.1597 -0.2028 0.0116 -0.0099 -0.1834 -0.1690 -0.2026 0.4989 0.0918 0.0468 0.1172 0.1068 0.0950 0.0844 0.0909 0.0924 0.0944 0.0906 0.1697 0.1772 0.1388 0.1293 0.1389 0.1171 0.1426 0.1414 0.1038 0.1037 0.0920
va: 1.1258 1.1185 1.1191 2.0730 2.0097 1.9782 3.1690 3.2105 3.7903 3.8812 3.8613 3.9239 3.9483 4.3901 4.1774 3.4621 4.0193 3.9665 3.7393 3.8648 3.9534 3.9402 3.8994 4.4414 1.0406 1.0202 1.0043 1.0271 1.0054 1.0027 1.0146 1.0050 1.0021 1.0008 1.0291 1.0057 1.0262 1.0336 1.0037 1.0277 1.0005 1.0019 0.9956 0.9960 1.0059
dispcorr: -0.023739439 hartree
energy: -1257.342757825062
dipole: 18.88535 -18.96768 -0.08232 27.87202 -26.45827 1.41374 6.77565 -5.76821 1.00744
magnitude: 1.73792 au
magnitude: 4.41745 debye
