program: Orca
programVersion: 5.0.2
elementType: F F F O O O N N C C C C C C C C C C C C C C C C H H H H H H H H H H H H H H H H H H H H H
charge: 0
multiplicity: 1
keywords: wb97x-d3
keywords: def2-TZVPP
keywords: def2/J RIJCOSX
keywords: DEFGRID2
keywords: scfconv7
keywords: smallprint printgap noloewdin
keywords: NOSOSCF
formula: C16H21F3N2O3
InChI: InChI=1/C16H21F3N2O3/c1-10(2)13(21-15(23)24-9-16(17,18)19)8-20-14(22)12-6-4-11(3)5-7-12/h4-7,10,13,20-21H,8-9H2,1-3H3
45 atoms
F  -0.938321 -3.694472 -1.53976
F  -0.025673 -3.917755 0.39366
F  -2.177778 -3.969974 0.205219
O  0.010434 -1.277324 -0.533121
O  0.792943 -0.896565 1.554235
O  0.644273 2.210625 -1.654462
N  1.99843 -0.350385 -0.302901
N  1.195138 2.170337 0.532841
C  2.989884 0.455171 0.371424
C  4.38226 0.196663 -0.216754
C  2.599511 1.949676 0.312005
C  4.762348 -1.275424 -0.096534
C  5.439745 1.071811 0.451567
C  0.930344 -0.843735 0.356525
C  0.30182 2.188508 -0.48731
C  -1.142371 2.192963 -0.102727
C  -2.058593 2.696494 -1.02275
C  -1.620943 1.67441 1.096936
C  -3.895875 2.205792 0.470785
C  -1.15295 -1.885222 -0.03535
C  -3.409997 2.711762 -0.733395
C  -2.979323 1.681861 1.37537
C  -5.367006 2.200601 0.762854
C  -1.064442 -3.382092 -0.248353
H  2.995111 0.134638 1.416244
H  4.35005 0.462068 -1.281929
H  3.16226 2.50949 1.0596
H  2.858236 2.365012 -0.663096
H  5.742832 -1.458278 -0.537523
H  4.809726 -1.581111 0.950914
H  4.046422 -1.925794 -0.596227
H  5.283293 2.135862 0.274799
H  5.45877 0.909476 1.531856
H  6.431423 0.828577 0.069745
H  1.900068 -0.223414 -1.299558
H  0.859763 2.153992 1.479369
H  -1.700034 3.080346 -1.968158
H  -0.953084 1.217321 1.81704
H  -2.002201 -1.488834 -0.594367
H  -1.306036 -1.676473 1.024675
H  -4.103487 3.12128 -1.458266
H  -3.329148 1.267863 2.313299
H  -5.866098 1.380359 0.243196
H  -5.566897 2.081791 1.826836
H  -5.842351 3.12516 0.435694
totalener: -1257.29196699 hartree
nucrepener: 2242.03910867 hartree
electener: -3499.33107566 hartree
oneelecener: -6179.26682151 hartree
twoeener: 2679.93574585 hartree
kineticenergy: 1252.26309177 hartree
xcener: -115.103476471679 hartree
chargesum: -0.0000000
charge: -0.169473 -0.164813 -0.175601 -0.297047 -0.415334 -0.418082 -0.215622 -0.182822 0.101769 0.001425 -0.104226 -0.255096 -0.284129 0.425443 0.347426 0.019042 -0.134751 -0.228171 0.019578 -0.026654 -0.138111 -0.151800 -0.203985 0.490881 0.090289 0.040753 0.103549 0.111313 0.086315 0.080370 0.093550 0.087523 0.085444 0.088454 0.154789 0.149883 0.130980 0.123646 0.119952 0.105847 0.114896 0.114771 0.101626 0.083802 0.092400
qa: -0.1695 -0.1648 -0.1756 -0.2970 -0.4153 -0.4181 -0.2156 -0.1828 0.1018 0.0014 -0.1042 -0.2551 -0.2841 0.4254 0.3474 0.0190 -0.1348 -0.2282 0.0196 -0.0267 -0.1381 -0.1518 -0.2040 0.4909 0.0903 0.0408 0.1035 0.1113 0.0863 0.0804 0.0936 0.0875 0.0854 0.0885 0.1548 0.1499 0.1310 0.1236 0.1200 0.1058 0.1149 0.1148 0.1016 0.0838 0.0924
va: 1.1364 1.1406 1.1314 2.0822 2.0914 2.0897 3.1506 3.1787 3.7938 3.9245 3.8763 3.9273 3.9459 4.3996 4.2038 3.5464 4.0662 3.9938 3.7822 3.9027 3.9536 4.0076 3.9087 4.4596 1.0384 1.0177 1.0063 1.0262 1.0072 1.0051 1.0186 1.0052 1.0034 1.0090 1.0410 1.0270 1.0279 1.0369 1.0031 1.0335 1.0075 1.0094 0.9939 1.0071 1.0015
dispcorr: -0.023633671 hartree
energy: -1257.315600665973
dipole: 18.61683 -18.69705 -0.08022 28.47190 -27.45703 1.01488 6.12327 -5.51020 0.61307
magnitude: 1.18838 au
magnitude: 3.02063 debye
